{"text_format":"1","workbook":"xlsx","n_sheets":5,"sheets":["Introduction","Input Screen","Rock Requirement Estimates","Final Report","Background"],"not_rendered":{"charts":5,"images":2,"macros":1,"external_links":0,"defined_names":6,"comments":0,"pivot_tables":0},"unopened":[],"bounds":{"document_bytes":16777216,"sheet_cells":100000,"rows_first":2000,"rows_last":500,"rows_between":2000,"halvings":0,"cell_chars":16384,"cell_head_chars":4096},"cells_cut":0,"cells_raw":0,"read":"whole","date_system":"1900"}

{"sheet":"Introduction","index":0,"n_rows":10,"n_cols":2,"rows_kept":10,"cut":false,"hidden":false,"merged":[]}
[]
[]
[]
[]
[]
[null,"Welcome to Iowa County Engineers Association (ICEA) Granular Roads Asset Management System (GRAMS)"]
[]
[null,"This tool is developed to help Iowa local agencies to approximate annual rock requirement to effectively maintain the granular roadway network. Local agencies can choose roadway treatment policy based on unique budget scenario and required level of service to determine amount of rock needed in terms of ton per mile (TPM)."]
[]
[null,"GRAMS tool consists of two major section. User needs to provide agency specific local information in the input screen regarding the granular roadway inventory condition and cost information. Based on input data, the tool will generate annual rock requirement report. "]

{"sheet":"Input Screen","index":1,"n_rows":31,"n_cols":4,"rows_kept":31,"cut":false,"hidden":false,"merged":[[16,3,17,3],[33,3,34,3],[5,3,9,3],[20,3,25,3]]}
[]
[]
[]
[]
[]
[null,"County Name",null,"Note: Enter county and granular roadway network informatiom"]
[]
[null,"Granular Roadway Network Size (miles)"]
[null,"Average Roadway Width (feet)"]
[null,"Percentage of Roadway with Poor Drainage (Ditch) Cross Section"]
[]
[]
[null,"Aggregate Properties"]
[null,"Los Angeles Abrasion (LAA) test result (%)",{"$f":"IF(Background!DH6=1,Background!AG6,IF(Background!DH6=2,Background!AG7,IF(Background!DH6=3,Background!AG8,IF(Background!DH6=4,Background!AG9,\"Error, Check county name spelling\"))))","v":"Error, Check county name spelling"}]
[null,"Percentage finer than #200 sieve (%)",{"$f":"IF(Background!DH6=1,Background!AH6,IF(Background!DH6=2,Background!AH7,IF(Background!DH6=3,Background!AH8,IF(Background!DH6=4,Background!AH9,\"Error, Check county name spelling\"))))","v":"Error, Check county name spelling"}]
[null,"or"]
[null,"Los Angeles Abrasion (LAA) test result (%)",null,"Note: Enter your estimation if you disagree with above values"]
[null,"Percentage finer than #200 sieve (%)"]
[]
[]
[null,"Purchase cost from producers ($/ton)",null,"Note: Enter material, transportation, hauling, placing, grading and miscellaneous cost information"]
[null,"Crushing cost ($/ton)"]
[null,"Source to stockpile hauling cost ($/ton)"]
[null,"Dump truck cost ($/ton -mile)"]
[null,"One way dump truck travel distance (mile)"]
[null,"Placing, grading and miscellaneous cost ($/ton)"]
[]
[]
[null,"Minimum acceptable roadway thickness (inches)",{"$f":"IF(Background!DH6=1,1.5,IF(Background!DH6=2,1.5,IF(Background!DH6=3,1.5,IF(Background!DH6=4,1.5,\"Error, Check county name spelling\"))))","v":"Error, Check county name spelling"}]
[]
[null,null,null,"Note: Enter your estimation if you disagree with above value. 5 inches of roadway thickness corresponds to 100% reliability and minimum acceptable thickness corresponds to 50% reliability"]

{"sheet":"Rock Requirement Estimates","index":2,"n_rows":25,"n_cols":7,"rows_kept":25,"cut":false,"hidden":false,"merged":[[8,4,11,4]]}
[]
[]
[]
[]
[]
[null,null,"Inventory Condition"]
[]
[null,"Roadway Condition","Thickness (inches)","Percentage of Granular Road Network"]
[null,"Excellent","over 5",null,"Note: Enter granular roadway network inventory information"]
[null,"Good","4 to 5"]
[null,"Fair","3 to 4"]
[null,"Poor","2 to 3"]
[null,"Unacceptable","below 2",{"$f":"IF((SUM(D9:D12)>1),\"Error, Percentage should not exceed 100%\",(1-SUM(D9:D12)))","v":1}]
[]
[null,"Annual Gravel Loss (inches)",{"$f":"Background!DP6","v":"Error, check county name spelling"}]
[]
[null,null,null,"Note: Enter your estimation if you disagree with above value"]
[]
[null,"Minimum Resurfacing Required (miles)"]
[]
[]
[]
[null,null,"Range of Options","Aggregate Type 1"]
[]
[null,"Tons per Mile (TPM)","Rock Quantity (Ton)","Annual Cost ($)","Material Cost ($)","Reliability (%)","System Performance"]

{"sheet":"Final Report","index":3,"n_rows":51,"n_cols":7,"rows_kept":51,"cut":false,"hidden":false,"merged":[[17,5,17,8],[50,4,50,9]]}
[]
[]
[]
[]
[]
[null,"County",{"$f":"'Input Screen'!C6","v":0}]
[null,"Most Critical System Size (miles)",{"$f":"'Rock Requirement Estimates'!C19","v":0}]
[null,null,null,"Range of Options"]
[null,null,null,"Rock Application Case (miles)",{"$f":"'Input Screen'!C8","v":0}]
[null,"Tons per Mile (TPM)","Rock Quantity (Ton)","Total Cost ($)","Material Cost ($)","Reliability (%)","System Performance"]
[null,{"$f":"'Rock Requirement Estimates'!B26","v":0},{"$f":"'Rock Requirement Estimates'!C26","v":0},{"$f":"'Rock Requirement Estimates'!D26","v":0},{"$f":"'Rock Requirement Estimates'!E26","v":0},{"$f":"'Rock Requirement Estimates'!F26","v":0},{"$f":"'Rock Requirement Estimates'!G26","v":0}]
[null,{"$f":"'Rock Requirement Estimates'!B27","v":0},{"$f":"'Rock Requirement Estimates'!C27","v":0},{"$f":"'Rock Requirement Estimates'!D27","v":0},{"$f":"'Rock Requirement Estimates'!E27","v":0},{"$f":"'Rock Requirement Estimates'!F27","v":0},{"$f":"'Rock Requirement Estimates'!G27","v":0}]
[null,{"$f":"'Rock Requirement Estimates'!B28","v":0},{"$f":"'Rock Requirement Estimates'!C28","v":0},{"$f":"'Rock Requirement Estimates'!D28","v":0},{"$f":"'Rock Requirement Estimates'!E28","v":0},{"$f":"'Rock Requirement Estimates'!F28","v":0},{"$f":"'Rock Requirement Estimates'!G28","v":0}]
[null,{"$f":"'Rock Requirement Estimates'!B29","v":0},{"$f":"'Rock Requirement Estimates'!C29","v":0},{"$f":"'Rock Requirement Estimates'!D29","v":0},{"$f":"'Rock Requirement Estimates'!E29","v":0},{"$f":"'Rock Requirement Estimates'!F29","v":0},{"$f":"'Rock Requirement Estimates'!G29","v":0}]
[null,{"$f":"'Rock Requirement Estimates'!B30","v":0},{"$f":"'Rock Requirement Estimates'!C30","v":0},{"$f":"'Rock Requirement Estimates'!D30","v":0},{"$f":"'Rock Requirement Estimates'!E30","v":0},{"$f":"'Rock Requirement Estimates'!F30","v":0},{"$f":"'Rock Requirement Estimates'!G30","v":0}]
[]
[]
[null,null,null,null,null,"Best Case Scenario"]
[]
[]
[]
[]
[]
[]
[]
[]
[]
[]
[]
[]
[]
[]
[]
[]
[]
[]
[]
[]
[]
[]
[]
[]
[]
[]
[]
[]
[null,null,"Range of Option"]
[null,"Rock Application Case",0.5]
[null,"Miles",{"$f":"C48*'Input Screen'!C8","v":0}]
[]
[null,null,null,null,"Roadway Maintenance Range of Options Simulations"]

{"sheet":"Background","index":4,"n_rows":506,"n_cols":125,"rows_kept":506,"cut":false,"hidden":false,"merged":[]}
[]
[]
[]
[null,"Roadway Surface Declination over time",null,null,"Thickness (inches)",null,null,null,null,null,null,null,null,null,null,null,null,null,null,null,null,null,"Type 1",null,null,null,"Survival Analysis Curve",null,null,null,null,null,null,null,null,null,null,null,"Level of Service","Type 1",null,null,null,null,null,"Rock Application Range",{"$f":"'Final Report'!$C$48","v":0.5},null,null,null,null,null,null,null,null,null,null,null,null,null,null,null,null,null,null,null,null,null,null,null,null,null,null,null,null,null,null,null,null,null,null,null,null,null,null,null,null,null,null,null,null,null,null,null,null,null,null,null,null,null,null,null,null,null,null,null,null,null,null,null,null,null,null,null,null,null,null,"Type 1"]
[null,"Current Condition","Existing","After 6 Months","After 12 Months","After 18 Months","After 24 months","After 36 Months","After 48 Months",null,null,"Weibull Distribution Parameters",null,null,"Resurfacing Needed after 1 Year (miles)","Rock in Service after 1 year (TPM)",null," Cost ($/Ton)",null,"system thickness (inchess)","Rock Requirement (Ton)","Tons per Mile (TPM)","System at Risk (%)","Cost ($)","Material Cost ($)","Time (months)","Failure Probability","Survival Probability",null,null,null,null,"LA Abrasion (%)","Percentage of Fines (%)",null,null,"TPM","Rock Quantity (Ton)","Thickness (inches)","Level of Service (%)","System Performance",null,null,null,"Rock Requirement (ton)","thickness (inches)","TPM","System at Risk (%)","Cost ($)","Material Cost ($)",null,null,"Minimum Acceptable Roadway thickness (inches)",null,null,null,null,null,null,null,null,null,null,null,null,null,null,null,null,null,null,null,null,null,null,null,null,null,null,null,null,null,null,null,null,null,null,null,null,null,null,null,null,null,null,null,null,null,null,null,null,null,null,null,"County","Precipitation Rate (in/hr)","Traffic (AADT)","Soil Quality","Zone","County","AADT","Zone",null,null,null,null,null,"LA Abrasion","% of fines","Gravel loss (in)",null,null,null,null,"Final Gravel loss"]
[null,"Excellent",5,{"$f":"IF(D18>=0,D18,0)","v":{"$error":"#VALUE!"}},{"$f":"IF(E18>=0,E18,0)","v":{"$error":"#VALUE!"}},{"$error":"#VALUE!"},{"$error":"#VALUE!"},{"$error":"#VALUE!"},{"$error":"#VALUE!"},null,null,"shape",{"$f":"IF((1/0.26+3.96*D25-0.11*I25)<=0,1.3,(1/0.26+3.96*D25-0.11*I25))","v":{"$error":"#VALUE!"}},null,{"$f":"(_xlfn.WEIBULL.DIST(12,$M$6,$M$7,TRUE)*'Input Screen'!$C$8)","v":{"$error":"#VALUE!"}},{"$f":"'Input Screen'!C8*'Input Screen'!C9*5280*Background!E12/12*0.0575/'Input Screen'!C8","v":{"$error":"#VALUE!"}},null,{"$f":"'Input Screen'!C21+'Input Screen'!C22+'Input Screen'!C23+'Input Screen'!C25*'Input Screen'!C24+'Input Screen'!C26","v":0},null,{"$f":"$E$13","v":{"$error":"#DIV/0!"}},{"$f":"'Input Screen'!$C$8*5280*'Input Screen'!$C$9*2*(T6-$T$6)/12*0.0575","v":{"$error":"#DIV/0!"}},{"$f":"U6/'Input Screen'!$C$8","v":{"$error":"#DIV/0!"}},{"$f":"1-(_xlfn.NORM.S.DIST((T6-$BA$6)/((MAX($T$6:$T$306)-$BA$6)/6),TRUE))","v":{"$error":"#DIV/0!"}},{"$f":"U6*$R$6/1000000","v":{"$error":"#DIV/0!"}},{"$f":"U6*'Input Screen'!$C$21/1000000","v":{"$error":"#DIV/0!"}},{"$f":"0.1","v":0.1},{"$f":"(_xlfn.WEIBULL.DIST(Z6,$M$6,$M$7,TRUE))","v":{"$error":"#VALUE!"}},{"$f":"1-AA6","v":{"$error":"#VALUE!"}},null,null,null,1,0.38500000000000001,6.6500000000000004E-2,null,null,100,{"$f":"2*'Input Screen'!$C$8*5280*'Input Screen'!$C$9*(Background!AM6-Background!$E$13)/12*0.0575","v":{"$error":"#DIV/0!"}},{"$f":"AK6*12/(5280*'Input Screen'!$C$9*2*0.0575)+$E$13","v":{"$error":"#DIV/0!"}},{"$f":"_xlfn.NORM.S.DIST((AM6-$BA$6)/((MAX($T$6:$T$306)-$BA$6)/6),TRUE)","v":{"$error":"#DIV/0!"}},{"$f":"IF(AN6<0.5,\"Poor\",IF(AN6<0.6,\"Marginal\",IF(AN6<0.7,\"Fair\",IF(AN6<0.8,\"Good\",IF(AN6<0.9,\"Very Good\",\"Excellent\")))))","v":{"$error":"#DIV/0!"}},null,null,null,{"$f":"'Input Screen'!$C$8*5280*$AU$4*'Input Screen'!$C$9*2*(T6-$T$6)/12*0.0575","v":{"$error":"#DIV/0!"}},{"$f":"$E$13","v":{"$error":"#DIV/0!"}},{"$f":"AS6/($AU$4*'Input Screen'!$C$8)","v":{"$error":"#DIV/0!"}},{"$f":"1-(_xlfn.NORM.S.DIST((AT6-$BA$6)/((MAX($T$6:$T$306)-$BA$6)/6),TRUE))","v":{"$error":"#DIV/0!"}},{"$f":"AS6*$R$6/1000000","v":{"$error":"#DIV/0!"}},{"$f":"AS6*'Input Screen'!$C$21/1000000","v":{"$error":"#DIV/0!"}},null,null,{"$f":"IF('Input Screen'!C31=0,'Input Screen'!C29,'Input Screen'!C31)","v":"Error, Check county name spelling"},null,null,null,null,null,null,null,null,null,null,null,null,null,null,null,null,null,null,null,null,null,null,null,null,null,null,null,null,null,null,null,null,null,null,null,null,null,null,null,null,null,null,null,null,null,null,null,null,null,null,null,"Adair",5.0309823365671039E-3,47,1.18,2,{"$f":"'Input Screen'!C6","v":0},{"$f":"IFERROR(VLOOKUP(DF6,DA5:DD105,3,FALSE),0)","v":0},{"$f":"IFERROR(VLOOKUP(DF6,DA5:DE105,5,FALSE),0)","v":0},null,null,null,null,null,{"$f":"IF('Input Screen'!C17=0,'Input Screen'!C14,'Input Screen'!C17)","v":"Error, Check county name spelling"},{"$f":"IF('Input Screen'!C18=0,'Input Screen'!C15,'Input Screen'!C18)","v":"Error, Check county name spelling"},{"$f":"IFERROR(AVERAGE(1/(1+EXP(-(-6.33+0.18*(DN6*100)))),1/(1+EXP(-(-27.2+2.41*(DO6*100)+0.15*(DG6))))),\"Error, check county name spelling\")","v":"Error, check county name spelling"},null,null,null,null,{"$f":"IF('Rock Requirement Estimates'!C17=0,'Rock Requirement Estimates'!C15,'Rock Requirement Estimates'!C17)","v":"Error, check county name spelling"}]
[null,"Good",4.5,{"$f":"IF(D19>=0,D19,0)","v":{"$error":"#VALUE!"}},{"$error":"#VALUE!"},{"$error":"#VALUE!"},{"$error":"#VALUE!"},{"$error":"#VALUE!"},{"$error":"#VALUE!"},null,null,"scale",{"$f":"72.3-33.22*F25-27.48*I25","v":{"$error":"#VALUE!"}},null,null,null,null,null,null,{"$f":"IF(T6>=5,5,T6+0.01)","v":{"$error":"#DIV/0!"}},{"$f":"'Input Screen'!$C$8*5280*'Input Screen'!$C$9*2*(T7-$T$6)/12*0.0575","v":{"$error":"#DIV/0!"}},{"$f":"U7/'Input Screen'!$C$8","v":{"$error":"#DIV/0!"}},{"$f":"1-(_xlfn.NORM.S.DIST((T7-$BA$6)/((MAX($T$6:$T$306)-$BA$6)/6),TRUE))","v":{"$error":"#DIV/0!"}},{"$f":"U7*$R$6/1000000","v":{"$error":"#DIV/0!"}},{"$f":"U7*'Input Screen'!$C$21/1000000","v":{"$error":"#DIV/0!"}},{"$f":"Z6+0.1","v":0.2},{"$f":"(_xlfn.WEIBULL.DIST(Z7,$M$6,$M$7,TRUE))","v":{"$error":"#VALUE!"}},{"$f":"1-AA7","v":{"$error":"#VALUE!"}},null,null,null,2,0.4022,8.2500000000000004E-2,null,null,200,{"$f":"2*'Input Screen'!$C$8*5280*'Input Screen'!$C$9*(Background!AM7-Background!$E$13)/12*0.0575","v":{"$error":"#DIV/0!"}},{"$f":"AK7*12/(5280*'Input Screen'!$C$9*2*0.0575)+$E$13","v":{"$error":"#DIV/0!"}},{"$f":"_xlfn.NORM.S.DIST((AM7-$BA$6)/((MAX($T$6:$T$306)-$BA$6)/6),TRUE)","v":{"$error":"#DIV/0!"}},{"$f":"IF(AN7<0.5,\"Poor\",IF(AN7<0.6,\"Marginal\",IF(AN7<0.7,\"Fair\",IF(AN7<0.8,\"Good\",IF(AN7<0.9,\"Very Good\",\"Excellent\")))))","v":{"$error":"#DIV/0!"}},null,null,null,{"$f":"'Input Screen'!$C$8*5280*$AU$4*'Input Screen'!$C$9*2*(T7-$T$6)/12*0.0575","v":{"$error":"#DIV/0!"}},{"$f":"IF(AT6>=5,5,AT6+0.01)","v":{"$error":"#DIV/0!"}},{"$f":"AS7/($AU$4*'Input Screen'!$C$8)","v":{"$error":"#DIV/0!"}},{"$f":"1-(_xlfn.NORM.S.DIST((AT7-$BA$6)/((MAX($T$6:$T$306)-$BA$6)/6),TRUE))","v":{"$error":"#DIV/0!"}},{"$f":"AS7*$R$6/1000000","v":{"$error":"#DIV/0!"}},{"$f":"AS7*'Input Screen'!$C$21/1000000","v":{"$error":"#DIV/0!"}},null,null,null,null,null,null,null,null,null,null,null,null,null,null,null,null,null,null,null,null,null,null,null,null,null,null,null,null,null,null,null,null,null,null,null,null,null,null,null,null,null,null,null,null,null,null,null,null,null,null,null,null,null,null,"Adams",5.1431685192561303E-3,32,1.22,2]
[null,"Fair",3.5,{"$error":"#VALUE!"},{"$error":"#VALUE!"},{"$error":"#VALUE!"},{"$error":"#VALUE!"},{"$error":"#VALUE!"},{"$error":"#VALUE!"},null,null,null,null,null,null,null,null,null,null,{"$f":"IF(T7>=5,5,T7+0.01)","v":{"$error":"#DIV/0!"}},{"$f":"'Input Screen'!$C$8*5280*'Input Screen'!$C$9*2*(T8-$T$6)/12*0.0575","v":{"$error":"#DIV/0!"}},{"$f":"U8/'Input Screen'!$C$8","v":{"$error":"#DIV/0!"}},{"$error":"#DIV/0!"},{"$error":"#DIV/0!"},{"$f":"U8*'Input Screen'!$C$21/1000000","v":{"$error":"#DIV/0!"}},{"$f":"Z7+0.1","v":0.30000000000000004},{"$error":"#VALUE!"},{"$error":"#VALUE!"},null,null,null,3,0.31569999999999998,7.8799999999999995E-2,null,null,300,{"$f":"2*'Input Screen'!$C$8*5280*'Input Screen'!$C$9*(Background!AM8-Background!$E$13)/12*0.0575","v":{"$error":"#DIV/0!"}},{"$f":"AK8*12/(5280*'Input Screen'!$C$9*2*0.0575)+$E$13","v":{"$error":"#DIV/0!"}},{"$error":"#DIV/0!"},{"$error":"#DIV/0!"},null,null,null,{"$f":"'Input Screen'!$C$8*5280*$AU$4*'Input Screen'!$C$9*2*(T8-$T$6)/12*0.0575","v":{"$error":"#DIV/0!"}},{"$f":"IF(AT7>=5,5,AT7+0.01)","v":{"$error":"#DIV/0!"}},{"$f":"AS8/($AU$4*'Input Screen'!$C$8)","v":{"$error":"#DIV/0!"}},{"$error":"#DIV/0!"},{"$error":"#DIV/0!"},{"$f":"AS8*'Input Screen'!$C$21/1000000","v":{"$error":"#DIV/0!"}},null,null,null,null,null,null,null,null,null,null,null,null,null,null,null,null,null,null,null,null,null,null,null,null,null,null,null,null,null,null,null,null,null,null,null,null,null,null,null,null,null,null,null,null,null,null,null,null,null,null,null,null,null,null,"Allamakee",5.1699999999999992E-3,55,1.58,2]
[null,"Poor",2.5,{"$error":"#VALUE!"},{"$error":"#VALUE!"},{"$error":"#VALUE!"},{"$error":"#VALUE!"},{"$error":"#VALUE!"},{"$error":"#VALUE!"},null,null,null,null,null,null,null,null,null,null,{"$error":"#DIV/0!"},{"$f":"'Input Screen'!$C$8*5280*'Input Screen'!$C$9*2*(T9-$T$6)/12*0.0575","v":{"$error":"#DIV/0!"}},{"$f":"U9/'Input Screen'!$C$8","v":{"$error":"#DIV/0!"}},{"$error":"#DIV/0!"},{"$error":"#DIV/0!"},{"$f":"U9*'Input Screen'!$C$21/1000000","v":{"$error":"#DIV/0!"}},0.4,{"$error":"#VALUE!"},{"$error":"#VALUE!"},null,null,null,4,0.33329999999999999,8.6699999999999999E-2,null,null,400,{"$f":"2*'Input Screen'!$C$8*5280*'Input Screen'!$C$9*(Background!AM9-Background!$E$13)/12*0.0575","v":{"$error":"#DIV/0!"}},{"$f":"AK9*12/(5280*'Input Screen'!$C$9*2*0.0575)+$E$13","v":{"$error":"#DIV/0!"}},{"$error":"#DIV/0!"},{"$error":"#DIV/0!"},null,null,null,{"$f":"'Input Screen'!$C$8*5280*$AU$4*'Input Screen'!$C$9*2*(T9-$T$6)/12*0.0575","v":{"$error":"#DIV/0!"}},{"$error":"#DIV/0!"},{"$f":"AS9/($AU$4*'Input Screen'!$C$8)","v":{"$error":"#DIV/0!"}},{"$error":"#DIV/0!"},{"$error":"#DIV/0!"},{"$f":"AS9*'Input Screen'!$C$21/1000000","v":{"$error":"#DIV/0!"}},null,null,null,null,null,null,null,null,null,null,null,null,null,null,null,null,null,null,null,null,null,null,null,null,null,null,null,null,null,null,null,null,null,null,null,null,null,null,null,null,null,null,null,null,null,null,null,null,null,null,null,null,null,null,"Appanoose",5.3516775341119786E-3,52,1.3,1]
[null,"Unacceptable",1.5,{"$error":"#VALUE!"},{"$error":"#VALUE!"},{"$error":"#VALUE!"},{"$error":"#VALUE!"},{"$error":"#VALUE!"},{"$error":"#VALUE!"},null,null,null,null,null,null,null,null,null,null,{"$error":"#DIV/0!"},{"$f":"'Input Screen'!$C$8*5280*'Input Screen'!$C$9*2*(T10-$T$6)/12*0.0575","v":{"$error":"#DIV/0!"}},{"$f":"U10/'Input Screen'!$C$8","v":{"$error":"#DIV/0!"}},{"$error":"#DIV/0!"},{"$error":"#DIV/0!"},{"$f":"U10*'Input Screen'!$C$21/1000000","v":{"$error":"#DIV/0!"}},0.5,{"$error":"#VALUE!"},{"$error":"#VALUE!"},null,null,null,null,"error",null,null,null,500,{"$f":"2*'Input Screen'!$C$8*5280*'Input Screen'!$C$9*(Background!AM10-Background!$E$13)/12*0.0575","v":{"$error":"#DIV/0!"}},{"$f":"AK10*12/(5280*'Input Screen'!$C$9*2*0.0575)+$E$13","v":{"$error":"#DIV/0!"}},{"$error":"#DIV/0!"},{"$error":"#DIV/0!"},null,null,null,{"$f":"'Input Screen'!$C$8*5280*$AU$4*'Input Screen'!$C$9*2*(T10-$T$6)/12*0.0575","v":{"$error":"#DIV/0!"}},{"$error":"#DIV/0!"},{"$f":"AS10/($AU$4*'Input Screen'!$C$8)","v":{"$error":"#DIV/0!"}},{"$error":"#DIV/0!"},{"$error":"#DIV/0!"},{"$f":"AS10*'Input Screen'!$C$21/1000000","v":{"$error":"#DIV/0!"}},null,null,null,null,null,null,null,null,null,null,null,null,null,null,null,null,null,null,null,null,null,null,null,null,null,null,null,null,null,null,null,null,null,null,null,null,null,null,null,null,null,null,null,null,null,null,null,null,null,null,null,null,null,null,"Audubon",4.8684606630779318E-3,37,1.1499999999999999,2]
[null,null,null,null,null,null,null,null,null,null,null,null,null,null,null,null,null,null,null,{"$error":"#DIV/0!"},{"$f":"'Input Screen'!$C$8*5280*'Input Screen'!$C$9*2*(T11-$T$6)/12*0.0575","v":{"$error":"#DIV/0!"}},{"$f":"U11/'Input Screen'!$C$8","v":{"$error":"#DIV/0!"}},{"$error":"#DIV/0!"},{"$error":"#DIV/0!"},{"$f":"U11*'Input Screen'!$C$21/1000000","v":{"$error":"#DIV/0!"}},0.6,{"$error":"#VALUE!"},{"$error":"#VALUE!"},null,null,null,null,null,null,null,null,null,null,null,null,null,null,null,null,{"$f":"'Input Screen'!$C$8*5280*$AU$4*'Input Screen'!$C$9*2*(T11-$T$6)/12*0.0575","v":{"$error":"#DIV/0!"}},{"$error":"#DIV/0!"},{"$f":"AS11/($AU$4*'Input Screen'!$C$8)","v":{"$error":"#DIV/0!"}},{"$error":"#DIV/0!"},{"$error":"#DIV/0!"},{"$f":"AS11*'Input Screen'!$C$21/1000000","v":{"$error":"#DIV/0!"}},null,null,null,null,null,null,null,null,null,null,null,null,null,null,null,null,null,null,null,null,null,null,null,null,null,null,null,null,null,null,null,null,null,null,null,null,null,null,null,null,null,null,null,null,null,null,null,null,null,null,null,null,null,null,"Benton",4.9107937345887155E-3,63,1.52,2]
[null,"System Thickness (inches)",{"$f":"('Input Screen'!$C$8*'Input Screen'!$C$9*('Rock Requirement Estimates'!$D$9*Background!C6+Background!C7*'Rock Requirement Estimates'!$D$10+Background!C8*'Rock Requirement Estimates'!$D$11+'Rock Requirement Estimates'!$D$12*Background!C9+Background!C10*'Rock Requirement Estimates'!$D$13))/('Input Screen'!$C$8*'Input Screen'!$C$9)","v":{"$error":"#DIV/0!"}},{"$f":"('Input Screen'!$C$8*'Input Screen'!$C$9*('Rock Requirement Estimates'!$D$9*Background!D6+Background!D7*'Rock Requirement Estimates'!$D$10+Background!D8*'Rock Requirement Estimates'!$D$11+'Rock Requirement Estimates'!$D$12*Background!D9+Background!D10*'Rock Requirement Estimates'!$D$13))/('Input Screen'!$C$8*'Input Screen'!$C$9)","v":{"$error":"#VALUE!"}},{"$f":"('Input Screen'!$C$8*'Input Screen'!$C$9*('Rock Requirement Estimates'!$D$9*Background!E6+Background!E7*'Rock Requirement Estimates'!$D$10+Background!E8*'Rock Requirement Estimates'!$D$11+'Rock Requirement Estimates'!$D$12*Background!E9+Background!E10*'Rock Requirement Estimates'!$D$13))/('Input Screen'!$C$8*'Input Screen'!$C$9)","v":{"$error":"#VALUE!"}},{"$f":"('Input Screen'!$C$8*'Input Screen'!$C$9*('Rock Requirement Estimates'!$D$9*Background!F6+Background!F7*'Rock Requirement Estimates'!$D$10+Background!F8*'Rock Requirement Estimates'!$D$11+'Rock Requirement Estimates'!$D$12*Background!F9+Background!F10*'Rock Requirement Estimates'!$D$13))/('Input Screen'!$C$8*'Input Screen'!$C$9)","v":{"$error":"#VALUE!"}},{"$f":"('Input Screen'!$C$8*'Input Screen'!$C$9*('Rock Requirement Estimates'!$D$9*Background!G6+Background!G7*'Rock Requirement Estimates'!$D$10+Background!G8*'Rock Requirement Estimates'!$D$11+'Rock Requirement Estimates'!$D$12*Background!G9+Background!G10*'Rock Requirement Estimates'!$D$13))/('Input Screen'!$C$8*'Input Screen'!$C$9)","v":{"$error":"#VALUE!"}},{"$f":"('Input Screen'!$C$8*'Input Screen'!$C$9*('Rock Requirement Estimates'!$D$9*Background!H6+Background!H7*'Rock Requirement Estimates'!$D$10+Background!H8*'Rock Requirement Estimates'!$D$11+'Rock Requirement Estimates'!$D$12*Background!H9+Background!H10*'Rock Requirement Estimates'!$D$13))/('Input Screen'!$C$8*'Input Screen'!$C$9)","v":{"$error":"#VALUE!"}},{"$f":"('Input Screen'!$C$8*'Input Screen'!$C$9*('Rock Requirement Estimates'!$D$9*Background!I6+Background!I7*'Rock Requirement Estimates'!$D$10+Background!I8*'Rock Requirement Estimates'!$D$11+'Rock Requirement Estimates'!$D$12*Background!I9+Background!I10*'Rock Requirement Estimates'!$D$13))/('Input Screen'!$C$8*'Input Screen'!$C$9)","v":{"$error":"#VALUE!"}},null,null,null,null,null,null,null,null,null,null,{"$error":"#DIV/0!"},{"$f":"'Input Screen'!$C$8*5280*'Input Screen'!$C$9*2*(T12-$T$6)/12*0.0575","v":{"$error":"#DIV/0!"}},{"$f":"U12/'Input Screen'!$C$8","v":{"$error":"#DIV/0!"}},{"$error":"#DIV/0!"},{"$error":"#DIV/0!"},{"$f":"U12*'Input Screen'!$C$21/1000000","v":{"$error":"#DIV/0!"}},0.7,{"$error":"#VALUE!"},{"$error":"#VALUE!"},null,null,null,null,null,null,null,null,null,null,null,null,null,null,null,null,{"$f":"'Input Screen'!$C$8*5280*$AU$4*'Input Screen'!$C$9*2*(T12-$T$6)/12*0.0575","v":{"$error":"#DIV/0!"}},{"$error":"#DIV/0!"},{"$f":"AS12/($AU$4*'Input Screen'!$C$8)","v":{"$error":"#DIV/0!"}},{"$error":"#DIV/0!"},{"$error":"#DIV/0!"},{"$f":"AS12*'Input Screen'!$C$21/1000000","v":{"$error":"#DIV/0!"}},null,null,null,null,null,null,null,null,null,null,null,null,null,null,null,null,null,null,null,null,null,null,null,null,null,null,null,null,null,null,null,null,null,null,null,null,null,null,null,null,null,null,null,null,null,null,null,null,null,null,null,null,null,null,"Black hawk",4.9792338641866185E-3,101,1.91,2]
[null,"System Thickness considering drainage (inches)",{"$f":"C12","v":{"$error":"#DIV/0!"}},{"$f":"(1-'Input Screen'!$C$10)*(Background!$C$13-Background!$DU$6/2)+'Input Screen'!$C$10*(-Background!$DU$6+Background!$C$12)","v":{"$error":"#DIV/0!"}},{"$f":"(1-'Input Screen'!$C$10)*(Background!$C$13-Background!$DU$6)+'Input Screen'!$C$10*(-Background!$DU$6*2+Background!$C$12)","v":{"$error":"#DIV/0!"}},null,null,null,null,null,null,null,null,null,null,null,null,null,null,{"$error":"#DIV/0!"},{"$f":"'Input Screen'!$C$8*5280*'Input Screen'!$C$9*2*(T13-$T$6)/12*0.0575","v":{"$error":"#DIV/0!"}},{"$f":"U13/'Input Screen'!$C$8","v":{"$error":"#DIV/0!"}},{"$error":"#DIV/0!"},{"$error":"#DIV/0!"},{"$f":"U13*'Input Screen'!$C$21/1000000","v":{"$error":"#DIV/0!"}},0.79999999999999993,{"$error":"#VALUE!"},{"$error":"#VALUE!"},null,null,null,null,null,null,null,null,null,null,null,null,null,null,null,null,{"$f":"'Input Screen'!$C$8*5280*$AU$4*'Input Screen'!$C$9*2*(T13-$T$6)/12*0.0575","v":{"$error":"#DIV/0!"}},{"$error":"#DIV/0!"},{"$f":"AS13/($AU$4*'Input Screen'!$C$8)","v":{"$error":"#DIV/0!"}},{"$error":"#DIV/0!"},{"$error":"#DIV/0!"},{"$f":"AS13*'Input Screen'!$C$21/1000000","v":{"$error":"#DIV/0!"}},null,null,null,null,null,null,null,null,null,null,null,null,null,null,null,null,null,null,null,null,null,null,null,null,null,null,null,null,null,null,null,null,null,null,null,null,null,null,null,null,null,null,null,null,null,null,null,null,null,null,null,null,null,null,"Boone",5.1970263051977399E-3,45,1.63,3]
[null,null,null,null,null,null,null,null,null,null,null,null,null,null,null,null,null,null,null,{"$error":"#DIV/0!"},{"$f":"'Input Screen'!$C$8*5280*'Input Screen'!$C$9*2*(T14-$T$6)/12*0.0575","v":{"$error":"#DIV/0!"}},{"$f":"U14/'Input Screen'!$C$8","v":{"$error":"#DIV/0!"}},{"$error":"#DIV/0!"},{"$error":"#DIV/0!"},{"$f":"U14*'Input Screen'!$C$21/1000000","v":{"$error":"#DIV/0!"}},0.89999999999999991,{"$error":"#VALUE!"},{"$error":"#VALUE!"},null,null,null,null,null,null,null,null,null,null,null,null,null,null,null,null,{"$f":"'Input Screen'!$C$8*5280*$AU$4*'Input Screen'!$C$9*2*(T14-$T$6)/12*0.0575","v":{"$error":"#DIV/0!"}},{"$error":"#DIV/0!"},{"$f":"AS14/($AU$4*'Input Screen'!$C$8)","v":{"$error":"#DIV/0!"}},{"$error":"#DIV/0!"},{"$error":"#DIV/0!"},{"$f":"AS14*'Input Screen'!$C$21/1000000","v":{"$error":"#DIV/0!"}},null,null,null,null,null,null,null,null,null,null,null,null,null,null,null,null,null,null,null,null,null,null,null,null,null,null,null,null,null,null,null,null,null,null,null,null,null,null,null,null,null,null,null,null,null,null,null,null,null,null,null,null,null,null,"Bremer",5.1003203071161149E-3,59,1.64,2]
[null,"System in unaccebtable condition (miles)",null,{"$f":"IF(AND(D6<$C$10,D7<$C$10,D8<$C$10,D9<$C$10,D10<$C$10),'Input Screen'!$C$8*('Rock Requirement Estimates'!$D$9+'Rock Requirement Estimates'!$D$10+'Rock Requirement Estimates'!$D$11+'Rock Requirement Estimates'!$D$12+'Rock Requirement Estimates'!$D$13),IF(AND(Background!D7<Background!$C$10,Background!D8<Background!$C$10,Background!D9<Background!$C$10,Background!D10<Background!$C$10),'Input Screen'!$C$8*('Rock Requirement Estimates'!$D$10+'Rock Requirement Estimates'!$D$11+'Rock Requirement Estimates'!$D$12+'Rock Requirement Estimates'!$D$13),IF(AND(Background!D8<Background!$C$10,Background!D9<Background!$C$10,Background!D10<Background!$C$10),'Input Screen'!$C$8*('Rock Requirement Estimates'!$D$11+'Rock Requirement Estimates'!$D$12+'Rock Requirement Estimates'!$D$13),IF(AND(Background!D9<Background!$C$10,Background!D10<Background!$C$10),'Input Screen'!$C$8*('Rock Requirement Estimates'!$D$12+'Rock Requirement Estimates'!$D$13),IF(AND(Background!D10<Background!$C$10),'Input Screen'!$C$8*'Rock Requirement Estimates'!$D$13)))))","v":{"$error":"#VALUE!"}},{"$f":"IF(AND(E6<$C$10,E7<$C$10,E8<$C$10,E9<$C$10,E10<$C$10),'Input Screen'!$C$8*('Rock Requirement Estimates'!$D$9+'Rock Requirement Estimates'!$D$10+'Rock Requirement Estimates'!$D$11+'Rock Requirement Estimates'!$D$12+'Rock Requirement Estimates'!$D$13),IF(AND(Background!E7<Background!$C$10,Background!E8<Background!$C$10,Background!E9<Background!$C$10,Background!E10<Background!$C$10),'Input Screen'!$C$8*('Rock Requirement Estimates'!$D$10+'Rock Requirement Estimates'!$D$11+'Rock Requirement Estimates'!$D$12+'Rock Requirement Estimates'!$D$13),IF(AND(Background!E8<Background!$C$10,Background!E9<Background!$C$10,Background!E10<Background!$C$10),'Input Screen'!$C$8*('Rock Requirement Estimates'!$D$11+'Rock Requirement Estimates'!$D$12+'Rock Requirement Estimates'!$D$13),IF(AND(Background!E9<Background!$C$10,Background!E10<Background!$C$10),'Input Screen'!$C$8*('Rock Requirement Estimates'!$D$12+'Rock Requirement Estimates'!$D$13),IF(AND(Background!E10<Background!$C$10),'Input Screen'!$C$8*'Rock Requirement Estimates'!$D$13)))))","v":{"$error":"#VALUE!"}},{"$f":"IF(AND(F6<$C$10,F7<$C$10,F8<$C$10,F9<$C$10,F10<$C$10),'Input Screen'!$C$8*('Rock Requirement Estimates'!$D$9+'Rock Requirement Estimates'!$D$10+'Rock Requirement Estimates'!$D$11+'Rock Requirement Estimates'!$D$12+'Rock Requirement Estimates'!$D$13),IF(AND(Background!F7<Background!$C$10,Background!F8<Background!$C$10,Background!F9<Background!$C$10,Background!F10<Background!$C$10),'Input Screen'!$C$8*('Rock Requirement Estimates'!$D$10+'Rock Requirement Estimates'!$D$11+'Rock Requirement Estimates'!$D$12+'Rock Requirement Estimates'!$D$13),IF(AND(Background!F8<Background!$C$10,Background!F9<Background!$C$10,Background!F10<Background!$C$10),'Input Screen'!$C$8*('Rock Requirement Estimates'!$D$11+'Rock Requirement Estimates'!$D$12+'Rock Requirement Estimates'!$D$13),IF(AND(Background!F9<Background!$C$10,Background!F10<Background!$C$10),'Input Screen'!$C$8*('Rock Requirement Estimates'!$D$12+'Rock Requirement Estimates'!$D$13),IF(AND(Background!F10<Background!$C$10),'Input Screen'!$C$8*'Rock Requirement Estimates'!$D$13)))))","v":{"$error":"#VALUE!"}},{"$f":"IF(AND(G6<$C$10,G7<$C$10,G8<$C$10,G9<$C$10,G10<$C$10),'Input Screen'!$C$8*('Rock Requirement Estimates'!$D$9+'Rock Requirement Estimates'!$D$10+'Rock Requirement Estimates'!$D$11+'Rock Requirement Estimates'!$D$12+'Rock Requirement Estimates'!$D$13),IF(AND(Background!G7<Background!$C$10,Background!G8<Background!$C$10,Background!G9<Background!$C$10,Background!G10<Background!$C$10),'Input Screen'!$C$8*('Rock Requirement Estimates'!$D$10+'Rock Requirement Estimates'!$D$11+'Rock Requirement Estimates'!$D$12+'Rock Requirement Estimates'!$D$13),IF(AND(Background!G8<Background!$C$10,Background!G9<Background!$C$10,Background!G10<Background!$C$10),'Input Screen'!$C$8*('Rock Requirement Estimates'!$D$11+'Rock Requirement Estimates'!$D$12+'Rock Requirement Estimates'!$D$13),IF(AND(Background!G9<Background!$C$10,Background!G10<Background!$C$10),'Input Screen'!$C$8*('Rock Requirement Estimates'!$D$12+'Rock Requirement Estimates'!$D$13),IF(AND(Background!G10<Background!$C$10),'Input Screen'!$C$8*'Rock Requirement Estimates'!$D$13)))))","v":{"$error":"#VALUE!"}},{"$f":"IF(AND(H6<$C$10,H7<$C$10,H8<$C$10,H9<$C$10,H10<$C$10),'Input Screen'!$C$8*('Rock Requirement Estimates'!$D$9+'Rock Requirement Estimates'!$D$10+'Rock Requirement Estimates'!$D$11+'Rock Requirement Estimates'!$D$12+'Rock Requirement Estimates'!$D$13),IF(AND(Background!H7<Background!$C$10,Background!H8<Background!$C$10,Background!H9<Background!$C$10,Background!H10<Background!$C$10),'Input Screen'!$C$8*('Rock Requirement Estimates'!$D$10+'Rock Requirement Estimates'!$D$11+'Rock Requirement Estimates'!$D$12+'Rock Requirement Estimates'!$D$13),IF(AND(Background!H8<Background!$C$10,Background!H9<Background!$C$10,Background!H10<Background!$C$10),'Input Screen'!$C$8*('Rock Requirement Estimates'!$D$11+'Rock Requirement Estimates'!$D$12+'Rock Requirement Estimates'!$D$13),IF(AND(Background!H9<Background!$C$10,Background!H10<Background!$C$10),'Input Screen'!$C$8*('Rock Requirement Estimates'!$D$12+'Rock Requirement Estimates'!$D$13),IF(AND(Background!H10<Background!$C$10),'Input Screen'!$C$8*'Rock Requirement Estimates'!$D$13)))))","v":{"$error":"#VALUE!"}},{"$f":"IF(AND(I6<$C$10,I7<$C$10,I8<$C$10,I9<$C$10,I10<$C$10),'Input Screen'!$C$8*('Rock Requirement Estimates'!$D$9+'Rock Requirement Estimates'!$D$10+'Rock Requirement Estimates'!$D$11+'Rock Requirement Estimates'!$D$12+'Rock Requirement Estimates'!$D$13),IF(AND(Background!I7<Background!$C$10,Background!I8<Background!$C$10,Background!I9<Background!$C$10,Background!I10<Background!$C$10),'Input Screen'!$C$8*('Rock Requirement Estimates'!$D$10+'Rock Requirement Estimates'!$D$11+'Rock Requirement Estimates'!$D$12+'Rock Requirement Estimates'!$D$13),IF(AND(Background!I8<Background!$C$10,Background!I9<Background!$C$10,Background!I10<Background!$C$10),'Input Screen'!$C$8*('Rock Requirement Estimates'!$D$11+'Rock Requirement Estimates'!$D$12+'Rock Requirement Estimates'!$D$13),IF(AND(Background!I9<Background!$C$10,Background!I10<Background!$C$10),'Input Screen'!$C$8*('Rock Requirement Estimates'!$D$12+'Rock Requirement Estimates'!$D$13),IF(AND(Background!I10<Background!$C$10),'Input Screen'!$C$8*'Rock Requirement Estimates'!$D$13)))))","v":{"$error":"#VALUE!"}},null,null,null,null,null,null,null,null,null,null,{"$error":"#DIV/0!"},{"$f":"'Input Screen'!$C$8*5280*'Input Screen'!$C$9*2*(T15-$T$6)/12*0.0575","v":{"$error":"#DIV/0!"}},{"$f":"U15/'Input Screen'!$C$8","v":{"$error":"#DIV/0!"}},{"$error":"#DIV/0!"},{"$error":"#DIV/0!"},{"$f":"U15*'Input Screen'!$C$21/1000000","v":{"$error":"#DIV/0!"}},0.99999999999999989,{"$error":"#VALUE!"},{"$error":"#VALUE!"},null,null,null,null,null,null,null,null,null,null,null,null,null,null,null,null,{"$f":"'Input Screen'!$C$8*5280*$AU$4*'Input Screen'!$C$9*2*(T15-$T$6)/12*0.0575","v":{"$error":"#DIV/0!"}},{"$error":"#DIV/0!"},{"$f":"AS15/($AU$4*'Input Screen'!$C$8)","v":{"$error":"#DIV/0!"}},{"$error":"#DIV/0!"},{"$error":"#DIV/0!"},{"$f":"AS15*'Input Screen'!$C$21/1000000","v":{"$error":"#DIV/0!"}},null,null,null,null,null,null,null,null,null,null,null,null,null,null,null,null,null,null,null,null,null,null,null,null,null,null,null,null,null,null,null,null,null,null,null,null,null,null,null,null,null,null,null,null,null,null,null,null,null,null,null,null,null,null,"Buchanan",4.9473904666255423E-3,66,1.85,3]
[null,null,null,null,null,null,null,null,null,null,null,null,null,null,null,null,null,null,null,{"$error":"#DIV/0!"},{"$f":"'Input Screen'!$C$8*5280*'Input Screen'!$C$9*2*(T16-$T$6)/12*0.0575","v":{"$error":"#DIV/0!"}},{"$f":"U16/'Input Screen'!$C$8","v":{"$error":"#DIV/0!"}},{"$error":"#DIV/0!"},{"$error":"#DIV/0!"},{"$f":"U16*'Input Screen'!$C$21/1000000","v":{"$error":"#DIV/0!"}},1.0999999999999999,{"$error":"#VALUE!"},{"$error":"#VALUE!"},null,null,null,null,null,null,null,null,null,null,null,null,null,null,null,null,{"$f":"'Input Screen'!$C$8*5280*$AU$4*'Input Screen'!$C$9*2*(T16-$T$6)/12*0.0575","v":{"$error":"#DIV/0!"}},{"$error":"#DIV/0!"},{"$f":"AS16/($AU$4*'Input Screen'!$C$8)","v":{"$error":"#DIV/0!"}},{"$error":"#DIV/0!"},{"$error":"#DIV/0!"},{"$f":"AS16*'Input Screen'!$C$21/1000000","v":{"$error":"#DIV/0!"}},null,null,null,null,null,null,null,null,null,null,null,null,null,null,null,null,null,null,null,null,null,null,null,null,null,null,null,null,null,null,null,null,null,null,null,null,null,null,null,null,null,null,null,null,null,null,null,null,null,null,null,null,null,null,"Buena vista",4.6007517133898413E-3,39,1.95,4]
[null,"Draft Analysis",null,null,null,null,null,null,null,null,null,null,null,null,null,null,null,null,null,{"$error":"#DIV/0!"},{"$f":"'Input Screen'!$C$8*5280*'Input Screen'!$C$9*2*(T17-$T$6)/12*0.0575","v":{"$error":"#DIV/0!"}},{"$f":"U17/'Input Screen'!$C$8","v":{"$error":"#DIV/0!"}},{"$error":"#DIV/0!"},{"$error":"#DIV/0!"},{"$f":"U17*'Input Screen'!$C$21/1000000","v":{"$error":"#DIV/0!"}},1.2,{"$error":"#VALUE!"},{"$error":"#VALUE!"},null,null,null,null,null,null,null,null,null,null,null,null,null,null,null,null,{"$f":"'Input Screen'!$C$8*5280*$AU$4*'Input Screen'!$C$9*2*(T17-$T$6)/12*0.0575","v":{"$error":"#DIV/0!"}},{"$error":"#DIV/0!"},{"$f":"AS17/($AU$4*'Input Screen'!$C$8)","v":{"$error":"#DIV/0!"}},{"$error":"#DIV/0!"},{"$error":"#DIV/0!"},{"$f":"AS17*'Input Screen'!$C$21/1000000","v":{"$error":"#DIV/0!"}},null,null,null,null,null,null,null,null,null,null,null,null,null,null,null,null,null,null,null,null,null,null,null,null,null,null,null,null,null,null,null,null,null,null,null,null,null,null,null,null,null,null,null,null,null,null,null,null,null,null,null,null,null,null,"Butler",4.8691505265908526E-3,45,1.78,3]
[null,null,5,{"$f":"IF('Rock Requirement Estimates'!$C$17=0,Background!$C$18-'Rock Requirement Estimates'!$C$15/2,Background!$C$18-'Rock Requirement Estimates'!$C$17/2)","v":{"$error":"#VALUE!"}},{"$f":"IF('Rock Requirement Estimates'!$C$17=0,Background!$C$18-'Rock Requirement Estimates'!$C$15,Background!$C$18-'Rock Requirement Estimates'!$C$17)","v":{"$error":"#VALUE!"}},{"$f":"IF('Rock Requirement Estimates'!$C$17=0,Background!$C$18-'Rock Requirement Estimates'!$C$15*1.5,Background!$C$18-'Rock Requirement Estimates'!$C$17*1.5)","v":{"$error":"#VALUE!"}},{"$f":"IF('Rock Requirement Estimates'!$C$17=0,Background!$C$18-'Rock Requirement Estimates'!$C$15*2,Background!$C$18-'Rock Requirement Estimates'!$C$17*2)","v":{"$error":"#VALUE!"}},{"$f":"IF('Rock Requirement Estimates'!$C$17=0,Background!$C$18-'Rock Requirement Estimates'!$C$15*3,Background!$C$18-'Rock Requirement Estimates'!$C$17*3)","v":{"$error":"#VALUE!"}},{"$f":"IF('Rock Requirement Estimates'!$C$17=0,Background!$C$18-'Rock Requirement Estimates'!$C$15*4,Background!$C$18-'Rock Requirement Estimates'!$C$17*4)","v":{"$error":"#VALUE!"}},null,null,null,null,null,null,null,null,null,null,{"$error":"#DIV/0!"},{"$f":"'Input Screen'!$C$8*5280*'Input Screen'!$C$9*2*(T18-$T$6)/12*0.0575","v":{"$error":"#DIV/0!"}},{"$f":"U18/'Input Screen'!$C$8","v":{"$error":"#DIV/0!"}},{"$error":"#DIV/0!"},{"$error":"#DIV/0!"},{"$f":"U18*'Input Screen'!$C$21/1000000","v":{"$error":"#DIV/0!"}},1.3,{"$error":"#VALUE!"},{"$error":"#VALUE!"},null,null,null,null,null,null,null,null,null,null,null,null,null,null,null,null,{"$f":"'Input Screen'!$C$8*5280*$AU$4*'Input Screen'!$C$9*2*(T18-$T$6)/12*0.0575","v":{"$error":"#DIV/0!"}},{"$error":"#DIV/0!"},{"$f":"AS18/($AU$4*'Input Screen'!$C$8)","v":{"$error":"#DIV/0!"}},{"$error":"#DIV/0!"},{"$error":"#DIV/0!"},{"$f":"AS18*'Input Screen'!$C$21/1000000","v":{"$error":"#DIV/0!"}},null,null,null,null,null,null,null,null,null,null,null,null,null,null,null,null,null,null,null,null,null,null,null,null,null,null,null,null,null,null,null,null,null,null,null,null,null,null,null,null,null,null,null,null,null,null,null,null,null,null,null,null,null,null,"Calhoun",4.7018705159525605E-3,34,2,4]
[null,null,4.5,{"$f":"IF('Rock Requirement Estimates'!$C$17=0,Background!$C$19-'Rock Requirement Estimates'!$C$15/2,Background!$C$19-'Rock Requirement Estimates'!$C$17/2)","v":{"$error":"#VALUE!"}},{"$f":"IF('Rock Requirement Estimates'!$C$17=0,Background!$C$19-'Rock Requirement Estimates'!$C$15,Background!$C$19-'Rock Requirement Estimates'!$C$17)","v":{"$error":"#VALUE!"}},{"$f":"IF('Rock Requirement Estimates'!$C$17=0,Background!$C$19-'Rock Requirement Estimates'!$C$15*1.5,Background!$C$19-'Rock Requirement Estimates'!$C$17*1.5)","v":{"$error":"#VALUE!"}},{"$f":"IF('Rock Requirement Estimates'!$C$17=0,Background!$C$19-'Rock Requirement Estimates'!$C$15*2,Background!$C$19-'Rock Requirement Estimates'!$C$17*2)","v":{"$error":"#VALUE!"}},{"$f":"IF('Rock Requirement Estimates'!$C$17=0,Background!$C$19-'Rock Requirement Estimates'!$C$15*3,Background!$C$19-'Rock Requirement Estimates'!$C$17*3)","v":{"$error":"#VALUE!"}},{"$f":"IF('Rock Requirement Estimates'!$C$17=0,Background!$C$19-'Rock Requirement Estimates'!$C$15*4,Background!$C$19-'Rock Requirement Estimates'!$C$17*4)","v":{"$error":"#VALUE!"}},null,null,null,null,null,null,null,null,null,null,{"$error":"#DIV/0!"},{"$f":"'Input Screen'!$C$8*5280*'Input Screen'!$C$9*2*(T19-$T$6)/12*0.0575","v":{"$error":"#DIV/0!"}},{"$f":"U19/'Input Screen'!$C$8","v":{"$error":"#DIV/0!"}},{"$error":"#DIV/0!"},{"$error":"#DIV/0!"},{"$f":"U19*'Input Screen'!$C$21/1000000","v":{"$error":"#DIV/0!"}},1.4000000000000001,{"$error":"#VALUE!"},{"$error":"#VALUE!"},null,null,null,null,null,null,null,null,null,null,null,null,null,null,null,null,{"$f":"'Input Screen'!$C$8*5280*$AU$4*'Input Screen'!$C$9*2*(T19-$T$6)/12*0.0575","v":{"$error":"#DIV/0!"}},{"$error":"#DIV/0!"},{"$f":"AS19/($AU$4*'Input Screen'!$C$8)","v":{"$error":"#DIV/0!"}},{"$error":"#DIV/0!"},{"$error":"#DIV/0!"},{"$f":"AS19*'Input Screen'!$C$21/1000000","v":{"$error":"#DIV/0!"}},null,null,null,null,null,null,null,null,null,null,null,null,null,null,null,null,null,null,null,null,null,null,null,null,null,null,null,null,null,null,null,null,null,null,null,null,null,null,null,null,null,null,null,null,null,null,null,null,null,null,null,null,null,null,"Carroll",4.7899344518700258E-3,50,1.75,3]
[null,null,3.5,{"$f":"IF('Rock Requirement Estimates'!$C$17=0,Background!$C$20-'Rock Requirement Estimates'!$C$15/2,Background!$C$20-'Rock Requirement Estimates'!$C$17/2)","v":{"$error":"#VALUE!"}},{"$f":"IF('Rock Requirement Estimates'!$C$17=0,Background!$C$20-'Rock Requirement Estimates'!$C$15,Background!$C$20-'Rock Requirement Estimates'!$C$17)","v":{"$error":"#VALUE!"}},{"$f":"IF('Rock Requirement Estimates'!$C$17=0,Background!$C$20-'Rock Requirement Estimates'!$C$15*1.5,Background!$C$20-'Rock Requirement Estimates'!$C$17*1.5)","v":{"$error":"#VALUE!"}},{"$f":"IF('Rock Requirement Estimates'!$C$17=0,Background!$C$20-'Rock Requirement Estimates'!$C$15*2,Background!$C$20-'Rock Requirement Estimates'!$C$17*2)","v":{"$error":"#VALUE!"}},{"$f":"IF('Rock Requirement Estimates'!$C$17=0,Background!$C$20-'Rock Requirement Estimates'!$C$15*3,Background!$C$20-'Rock Requirement Estimates'!$C$17*3)","v":{"$error":"#VALUE!"}},{"$f":"IF('Rock Requirement Estimates'!$C$17=0,Background!$C$20-'Rock Requirement Estimates'!$C$15*4,Background!$C$20-'Rock Requirement Estimates'!$C$17*4)","v":{"$error":"#VALUE!"}},null,null,null,null,null,null,null,null,null,null,{"$error":"#DIV/0!"},{"$f":"'Input Screen'!$C$8*5280*'Input Screen'!$C$9*2*(T20-$T$6)/12*0.0575","v":{"$error":"#DIV/0!"}},{"$f":"U20/'Input Screen'!$C$8","v":{"$error":"#DIV/0!"}},{"$error":"#DIV/0!"},{"$error":"#DIV/0!"},{"$f":"U20*'Input Screen'!$C$21/1000000","v":{"$error":"#DIV/0!"}},1.5000000000000002,{"$error":"#VALUE!"},{"$error":"#VALUE!"},null,null,null,null,null,null,null,null,null,null,null,null,null,null,null,null,{"$f":"'Input Screen'!$C$8*5280*$AU$4*'Input Screen'!$C$9*2*(T20-$T$6)/12*0.0575","v":{"$error":"#DIV/0!"}},{"$error":"#DIV/0!"},{"$f":"AS20/($AU$4*'Input Screen'!$C$8)","v":{"$error":"#DIV/0!"}},{"$error":"#DIV/0!"},{"$error":"#DIV/0!"},{"$f":"AS20*'Input Screen'!$C$21/1000000","v":{"$error":"#DIV/0!"}},null,null,null,null,null,null,null,null,null,null,null,null,null,null,null,null,null,null,null,null,null,null,null,null,null,null,null,null,null,null,null,null,null,null,null,null,null,null,null,null,null,null,null,null,null,null,null,null,null,null,null,null,null,null,"Cass",4.8684606630779318E-3,38,1.25,3]
[null,null,2.5,{"$f":"IF('Rock Requirement Estimates'!$C$17=0,Background!$C$21-'Rock Requirement Estimates'!$C$15/2,Background!$C$21-'Rock Requirement Estimates'!$C$17/2)","v":{"$error":"#VALUE!"}},{"$f":"IF('Rock Requirement Estimates'!$C$17=0,Background!$C$21-'Rock Requirement Estimates'!$C$15,Background!$C$21-'Rock Requirement Estimates'!$C$17)","v":{"$error":"#VALUE!"}},{"$f":"IF('Rock Requirement Estimates'!$C$17=0,Background!$C$21-'Rock Requirement Estimates'!$C$15*1.5,Background!$C$21-'Rock Requirement Estimates'!$C$17*1.5)","v":{"$error":"#VALUE!"}},{"$f":"IF('Rock Requirement Estimates'!$C$17=0,Background!$C$21-'Rock Requirement Estimates'!$C$15*2,Background!$C$21-'Rock Requirement Estimates'!$C$17*2)","v":{"$error":"#VALUE!"}},{"$f":"IF('Rock Requirement Estimates'!$C$17=0,Background!$C$21-'Rock Requirement Estimates'!$C$15*3,Background!$C$21-'Rock Requirement Estimates'!$C$17*3)","v":{"$error":"#VALUE!"}},{"$f":"IF('Rock Requirement Estimates'!$C$17=0,Background!$C$21-'Rock Requirement Estimates'!$C$15*4,Background!$C$21-'Rock Requirement Estimates'!$C$17*4)","v":{"$error":"#VALUE!"}},null,null,null,null,null,null,null,null,null,null,{"$error":"#DIV/0!"},{"$f":"'Input Screen'!$C$8*5280*'Input Screen'!$C$9*2*(T21-$T$6)/12*0.0575","v":{"$error":"#DIV/0!"}},{"$f":"U21/'Input Screen'!$C$8","v":{"$error":"#DIV/0!"}},{"$error":"#DIV/0!"},{"$error":"#DIV/0!"},{"$f":"U21*'Input Screen'!$C$21/1000000","v":{"$error":"#DIV/0!"}},1.6000000000000003,{"$error":"#VALUE!"},{"$error":"#VALUE!"},null,null,null,null,null,null,null,null,null,null,null,null,null,null,null,null,{"$f":"'Input Screen'!$C$8*5280*$AU$4*'Input Screen'!$C$9*2*(T21-$T$6)/12*0.0575","v":{"$error":"#DIV/0!"}},{"$error":"#DIV/0!"},{"$f":"AS21/($AU$4*'Input Screen'!$C$8)","v":{"$error":"#DIV/0!"}},{"$error":"#DIV/0!"},{"$error":"#DIV/0!"},{"$f":"AS21*'Input Screen'!$C$21/1000000","v":{"$error":"#DIV/0!"}},null,null,null,null,null,null,null,null,null,null,null,null,null,null,null,null,null,null,null,null,null,null,null,null,null,null,null,null,null,null,null,null,null,null,null,null,null,null,null,null,null,null,null,null,null,null,null,null,null,null,null,null,null,null,"Cedar",5.17285088709843E-3,62,1.45,2]
[null,null,1.5,{"$f":"IF('Rock Requirement Estimates'!$C$17=0,Background!$C$22-'Rock Requirement Estimates'!$C$15/2,Background!$C$22-'Rock Requirement Estimates'!$C$17/2)","v":{"$error":"#VALUE!"}},{"$f":"IF('Rock Requirement Estimates'!$C$17=0,Background!$C$22-'Rock Requirement Estimates'!$C$15,Background!$C$22-'Rock Requirement Estimates'!$C$17)","v":{"$error":"#VALUE!"}},{"$f":"IF('Rock Requirement Estimates'!$C$17=0,Background!$C$22-'Rock Requirement Estimates'!$C$15*1.5,Background!$C$22-'Rock Requirement Estimates'!$C$17*1.5)","v":{"$error":"#VALUE!"}},{"$f":"IF('Rock Requirement Estimates'!$C$17=0,Background!$C$22-'Rock Requirement Estimates'!$C$15*2,Background!$C$22-'Rock Requirement Estimates'!$C$17*2)","v":{"$error":"#VALUE!"}},{"$f":"IF('Rock Requirement Estimates'!$C$17=0,Background!$C$22-'Rock Requirement Estimates'!$C$15*3,Background!$C$22-'Rock Requirement Estimates'!$C$17*3)","v":{"$error":"#VALUE!"}},{"$f":"IF('Rock Requirement Estimates'!$C$17=0,Background!$C$22-'Rock Requirement Estimates'!$C$15*4,Background!$C$22-'Rock Requirement Estimates'!$C$17*4)","v":{"$error":"#VALUE!"}},null,null,null,null,null,null,null,null,null,null,{"$error":"#DIV/0!"},{"$f":"'Input Screen'!$C$8*5280*'Input Screen'!$C$9*2*(T22-$T$6)/12*0.0575","v":{"$error":"#DIV/0!"}},{"$f":"U22/'Input Screen'!$C$8","v":{"$error":"#DIV/0!"}},{"$error":"#DIV/0!"},{"$error":"#DIV/0!"},{"$f":"U22*'Input Screen'!$C$21/1000000","v":{"$error":"#DIV/0!"}},1.7000000000000004,{"$error":"#VALUE!"},{"$error":"#VALUE!"},null,null,null,null,null,null,null,null,null,null,null,null,null,null,null,null,{"$f":"'Input Screen'!$C$8*5280*$AU$4*'Input Screen'!$C$9*2*(T22-$T$6)/12*0.0575","v":{"$error":"#DIV/0!"}},{"$error":"#DIV/0!"},{"$f":"AS22/($AU$4*'Input Screen'!$C$8)","v":{"$error":"#DIV/0!"}},{"$error":"#DIV/0!"},{"$error":"#DIV/0!"},{"$f":"AS22*'Input Screen'!$C$21/1000000","v":{"$error":"#DIV/0!"}},null,null,null,null,null,null,null,null,null,null,null,null,null,null,null,null,null,null,null,null,null,null,null,null,null,null,null,null,null,null,null,null,null,null,null,null,null,null,null,null,null,null,null,null,null,null,null,null,null,null,null,null,null,null,"Cerro Gordo",4.8691505265908526E-3,54,1.91,3]
[null,null,null,null,null,null,null,null,null,null,null,null,null,null,null,null,null,null,null,{"$error":"#DIV/0!"},{"$f":"'Input Screen'!$C$8*5280*'Input Screen'!$C$9*2*(T23-$T$6)/12*0.0575","v":{"$error":"#DIV/0!"}},{"$f":"U23/'Input Screen'!$C$8","v":{"$error":"#DIV/0!"}},{"$error":"#DIV/0!"},{"$error":"#DIV/0!"},{"$f":"U23*'Input Screen'!$C$21/1000000","v":{"$error":"#DIV/0!"}},1.8000000000000005,{"$error":"#VALUE!"},{"$error":"#VALUE!"},null,null,null,null,null,null,null,null,null,null,null,null,null,null,null,null,{"$f":"'Input Screen'!$C$8*5280*$AU$4*'Input Screen'!$C$9*2*(T23-$T$6)/12*0.0575","v":{"$error":"#DIV/0!"}},{"$error":"#DIV/0!"},{"$f":"AS23/($AU$4*'Input Screen'!$C$8)","v":{"$error":"#DIV/0!"}},{"$error":"#DIV/0!"},{"$error":"#DIV/0!"},{"$f":"AS23*'Input Screen'!$C$21/1000000","v":{"$error":"#DIV/0!"}},null,null,null,null,null,null,null,null,null,null,null,null,null,null,null,null,null,null,null,null,null,null,null,null,null,null,null,null,null,null,null,null,null,null,null,null,null,null,null,null,null,null,null,null,null,null,null,null,null,null,null,null,null,null,"Cherokee",4.4375674940068813E-3,37,1.73,4]
[null,null,null,null,null,null,null,null,null,null,null,null,null,null,null,null,null,null,null,{"$error":"#DIV/0!"},{"$f":"'Input Screen'!$C$8*5280*'Input Screen'!$C$9*2*(T24-$T$6)/12*0.0575","v":{"$error":"#DIV/0!"}},{"$f":"U24/'Input Screen'!$C$8","v":{"$error":"#DIV/0!"}},{"$error":"#DIV/0!"},{"$error":"#DIV/0!"},{"$f":"U24*'Input Screen'!$C$21/1000000","v":{"$error":"#DIV/0!"}},1.9000000000000006,{"$error":"#VALUE!"},{"$error":"#VALUE!"},null,null,null,null,null,null,null,null,null,null,null,null,null,null,null,null,{"$f":"'Input Screen'!$C$8*5280*$AU$4*'Input Screen'!$C$9*2*(T24-$T$6)/12*0.0575","v":{"$error":"#DIV/0!"}},{"$error":"#DIV/0!"},{"$f":"AS24/($AU$4*'Input Screen'!$C$8)","v":{"$error":"#DIV/0!"}},{"$error":"#DIV/0!"},{"$error":"#DIV/0!"},{"$f":"AS24*'Input Screen'!$C$21/1000000","v":{"$error":"#DIV/0!"}},null,null,null,null,null,null,null,null,null,null,null,null,null,null,null,null,null,null,null,null,null,null,null,null,null,null,null,null,null,null,null,null,null,null,null,null,null,null,null,null,null,null,null,null,null,null,null,null,null,null,null,null,null,null,"Chickasaw",5.0622299910157934E-3,55,2.04,3]
[null,"coefficients for weibull modelling",null,{"$f":"D15/'Input Screen'!$C$8","v":{"$error":"#VALUE!"}},{"$f":"E15/'Input Screen'!$C$8","v":{"$error":"#VALUE!"}},{"$f":"F15/'Input Screen'!$C$8","v":{"$error":"#VALUE!"}},{"$f":"G15/'Input Screen'!$C$8","v":{"$error":"#VALUE!"}},{"$f":"H15/'Input Screen'!$C$8","v":{"$error":"#VALUE!"}},{"$f":"I15/'Input Screen'!$C$8","v":{"$error":"#VALUE!"}},null,null,null,null,null,null,null,null,null,null,{"$error":"#DIV/0!"},{"$f":"'Input Screen'!$C$8*5280*'Input Screen'!$C$9*2*(T25-$T$6)/12*0.0575","v":{"$error":"#DIV/0!"}},{"$f":"U25/'Input Screen'!$C$8","v":{"$error":"#DIV/0!"}},{"$error":"#DIV/0!"},{"$error":"#DIV/0!"},{"$f":"U25*'Input Screen'!$C$21/1000000","v":{"$error":"#DIV/0!"}},2.0000000000000004,{"$error":"#VALUE!"},{"$error":"#VALUE!"},null,null,null,null,null,null,null,null,null,null,null,null,null,null,null,null,{"$f":"'Input Screen'!$C$8*5280*$AU$4*'Input Screen'!$C$9*2*(T25-$T$6)/12*0.0575","v":{"$error":"#DIV/0!"}},{"$error":"#DIV/0!"},{"$f":"AS25/($AU$4*'Input Screen'!$C$8)","v":{"$error":"#DIV/0!"}},{"$error":"#DIV/0!"},{"$error":"#DIV/0!"},{"$f":"AS25*'Input Screen'!$C$21/1000000","v":{"$error":"#DIV/0!"}},null,null,null,null,null,null,null,null,null,null,null,null,null,null,null,null,null,null,null,null,null,null,null,null,null,null,null,null,null,null,null,null,null,null,null,null,null,null,null,null,null,null,null,null,null,null,null,null,null,null,null,null,null,null,"Clark",5.1734820742796051E-3,96,1.1599999999999999,1]
[null,null,null,null,null,null,null,null,null,null,null,null,null,null,null,null,null,null,null,{"$error":"#DIV/0!"},{"$f":"'Input Screen'!$C$8*5280*'Input Screen'!$C$9*2*(T26-$T$6)/12*0.0575","v":{"$error":"#DIV/0!"}},{"$f":"U26/'Input Screen'!$C$8","v":{"$error":"#DIV/0!"}},{"$error":"#DIV/0!"},{"$error":"#DIV/0!"},{"$f":"U26*'Input Screen'!$C$21/1000000","v":{"$error":"#DIV/0!"}},2.1000000000000005,{"$error":"#VALUE!"},{"$error":"#VALUE!"},null,null,null,null,null,null,null,null,null,null,null,null,null,null,null,null,{"$f":"'Input Screen'!$C$8*5280*$AU$4*'Input Screen'!$C$9*2*(T26-$T$6)/12*0.0575","v":{"$error":"#DIV/0!"}},{"$error":"#DIV/0!"},{"$f":"AS26/($AU$4*'Input Screen'!$C$8)","v":{"$error":"#DIV/0!"}},{"$error":"#DIV/0!"},{"$error":"#DIV/0!"},{"$f":"AS26*'Input Screen'!$C$21/1000000","v":{"$error":"#DIV/0!"}},null,null,null,null,null,null,null,null,null,null,null,null,null,null,null,null,null,null,null,null,null,null,null,null,null,null,null,null,null,null,null,null,null,null,null,null,null,null,null,null,null,null,null,null,null,null,null,null,null,null,null,null,null,null,"Clay",4.4779237627564951E-3,54,1.77,4]
[null,null,null,null,null,null,null,null,null,null,null,null,null,null,null,null,null,null,null,{"$error":"#DIV/0!"},{"$f":"'Input Screen'!$C$8*5280*'Input Screen'!$C$9*2*(T27-$T$6)/12*0.0575","v":{"$error":"#DIV/0!"}},{"$f":"U27/'Input Screen'!$C$8","v":{"$error":"#DIV/0!"}},{"$error":"#DIV/0!"},{"$error":"#DIV/0!"},{"$f":"U27*'Input Screen'!$C$21/1000000","v":{"$error":"#DIV/0!"}},2.2000000000000006,{"$error":"#VALUE!"},{"$error":"#VALUE!"},null,null,null,null,null,null,null,null,null,null,null,null,null,null,null,null,{"$f":"'Input Screen'!$C$8*5280*$AU$4*'Input Screen'!$C$9*2*(T27-$T$6)/12*0.0575","v":{"$error":"#DIV/0!"}},{"$error":"#DIV/0!"},{"$f":"AS27/($AU$4*'Input Screen'!$C$8)","v":{"$error":"#DIV/0!"}},{"$error":"#DIV/0!"},{"$error":"#DIV/0!"},{"$f":"AS27*'Input Screen'!$C$21/1000000","v":{"$error":"#DIV/0!"}},null,null,null,null,null,null,null,null,null,null,null,null,null,null,null,null,null,null,null,null,null,null,null,null,null,null,null,null,null,null,null,null,null,null,null,null,null,null,null,null,null,null,null,null,null,null,null,null,null,null,null,null,null,null,"Clayton",5.0868053916727904E-3,59,1.65,2]
[null,null,null,null,null,null,null,null,null,null,null,null,null,null,null,null,null,null,null,{"$error":"#DIV/0!"},{"$f":"'Input Screen'!$C$8*5280*'Input Screen'!$C$9*2*(T28-$T$6)/12*0.0575","v":{"$error":"#DIV/0!"}},{"$f":"U28/'Input Screen'!$C$8","v":{"$error":"#DIV/0!"}},{"$error":"#DIV/0!"},{"$error":"#DIV/0!"},{"$f":"U28*'Input Screen'!$C$21/1000000","v":{"$error":"#DIV/0!"}},2.3000000000000007,{"$error":"#VALUE!"},{"$error":"#VALUE!"},null,null,null,null,null,null,null,null,null,null,null,null,null,null,null,null,{"$f":"'Input Screen'!$C$8*5280*$AU$4*'Input Screen'!$C$9*2*(T28-$T$6)/12*0.0575","v":{"$error":"#DIV/0!"}},{"$error":"#DIV/0!"},{"$f":"AS28/($AU$4*'Input Screen'!$C$8)","v":{"$error":"#DIV/0!"}},{"$error":"#DIV/0!"},{"$error":"#DIV/0!"},{"$f":"AS28*'Input Screen'!$C$21/1000000","v":{"$error":"#DIV/0!"}},null,null,null,null,null,null,null,null,null,null,null,null,null,null,null,null,null,null,null,null,null,null,null,null,null,null,null,null,null,null,null,null,null,null,null,null,null,null,null,null,null,null,null,null,null,null,null,null,null,null,null,null,null,null,"Clinton",5.1144031177202702E-3,57,1.57,2]
[null,null,null,null,null,null,null,null,null,null,null,null,null,null,null,null,null,null,null,{"$error":"#DIV/0!"},{"$f":"'Input Screen'!$C$8*5280*'Input Screen'!$C$9*2*(T29-$T$6)/12*0.0575","v":{"$error":"#DIV/0!"}},{"$f":"U29/'Input Screen'!$C$8","v":{"$error":"#DIV/0!"}},{"$error":"#DIV/0!"},{"$error":"#DIV/0!"},{"$f":"U29*'Input Screen'!$C$21/1000000","v":{"$error":"#DIV/0!"}},2.4000000000000008,{"$error":"#VALUE!"},{"$error":"#VALUE!"},null,null,null,null,null,null,null,null,null,null,null,null,null,null,null,null,{"$f":"'Input Screen'!$C$8*5280*$AU$4*'Input Screen'!$C$9*2*(T29-$T$6)/12*0.0575","v":{"$error":"#DIV/0!"}},{"$error":"#DIV/0!"},{"$f":"AS29/($AU$4*'Input Screen'!$C$8)","v":{"$error":"#DIV/0!"}},{"$error":"#DIV/0!"},{"$error":"#DIV/0!"},{"$f":"AS29*'Input Screen'!$C$21/1000000","v":{"$error":"#DIV/0!"}},null,null,null,null,null,null,null,null,null,null,null,null,null,null,null,null,null,null,null,null,null,null,null,null,null,null,null,null,null,null,null,null,null,null,null,null,null,null,null,null,null,null,null,null,null,null,null,null,null,null,null,null,null,null,"Crawford",4.6519375888325375E-3,46,1.87,4]
[null,null,null,null,null,null,null,null,null,null,null,null,null,null,null,null,null,null,null,{"$error":"#DIV/0!"},{"$f":"'Input Screen'!$C$8*5280*'Input Screen'!$C$9*2*(T30-$T$6)/12*0.0575","v":{"$error":"#DIV/0!"}},{"$f":"U30/'Input Screen'!$C$8","v":{"$error":"#DIV/0!"}},{"$error":"#DIV/0!"},{"$error":"#DIV/0!"},{"$f":"U30*'Input Screen'!$C$21/1000000","v":{"$error":"#DIV/0!"}},2.5000000000000009,{"$error":"#VALUE!"},{"$error":"#VALUE!"},null,null,null,null,null,null,null,null,null,null,null,null,null,null,null,null,{"$f":"'Input Screen'!$C$8*5280*$AU$4*'Input Screen'!$C$9*2*(T30-$T$6)/12*0.0575","v":{"$error":"#DIV/0!"}},{"$error":"#DIV/0!"},{"$f":"AS30/($AU$4*'Input Screen'!$C$8)","v":{"$error":"#DIV/0!"}},{"$error":"#DIV/0!"},{"$error":"#DIV/0!"},{"$f":"AS30*'Input Screen'!$C$21/1000000","v":{"$error":"#DIV/0!"}},null,null,null,null,null,null,null,null,null,null,null,null,null,null,null,null,null,null,null,null,null,null,null,null,null,null,null,null,null,null,null,null,null,null,null,null,null,null,null,null,null,null,null,null,null,null,null,null,null,null,null,null,null,null,"Dallas",5.0309823365671039E-3,102,1.9,2]
[null,null,null,null,null,null,null,null,null,null,null,null,null,null,null,null,null,null,null,{"$error":"#DIV/0!"},{"$f":"'Input Screen'!$C$8*5280*'Input Screen'!$C$9*2*(T31-$T$6)/12*0.0575","v":{"$error":"#DIV/0!"}},{"$f":"U31/'Input Screen'!$C$8","v":{"$error":"#DIV/0!"}},{"$error":"#DIV/0!"},{"$error":"#DIV/0!"},{"$f":"U31*'Input Screen'!$C$21/1000000","v":{"$error":"#DIV/0!"}},2.600000000000001,{"$error":"#VALUE!"},{"$error":"#VALUE!"},null,null,null,null,null,null,null,null,null,null,null,null,null,null,null,null,{"$f":"'Input Screen'!$C$8*5280*$AU$4*'Input Screen'!$C$9*2*(T31-$T$6)/12*0.0575","v":{"$error":"#DIV/0!"}},{"$error":"#DIV/0!"},{"$f":"AS31/($AU$4*'Input Screen'!$C$8)","v":{"$error":"#DIV/0!"}},{"$error":"#DIV/0!"},{"$error":"#DIV/0!"},{"$f":"AS31*'Input Screen'!$C$21/1000000","v":{"$error":"#DIV/0!"}},null,null,null,null,null,null,null,null,null,null,null,null,null,null,null,null,null,null,null,null,null,null,null,null,null,null,null,null,null,null,null,null,null,null,null,null,null,null,null,null,null,null,null,null,null,null,null,null,null,null,null,null,null,null,"Davis",5.3516775341119786E-3,55,1.23,1]
[null,null,null,null,null,null,null,null,null,null,null,null,null,null,null,null,null,null,null,{"$error":"#DIV/0!"},{"$f":"'Input Screen'!$C$8*5280*'Input Screen'!$C$9*2*(T32-$T$6)/12*0.0575","v":{"$error":"#DIV/0!"}},{"$f":"U32/'Input Screen'!$C$8","v":{"$error":"#DIV/0!"}},{"$error":"#DIV/0!"},{"$error":"#DIV/0!"},{"$f":"U32*'Input Screen'!$C$21/1000000","v":{"$error":"#DIV/0!"}},2.7000000000000011,{"$error":"#VALUE!"},{"$error":"#VALUE!"},null,null,null,null,null,null,null,null,null,null,null,null,null,null,null,null,{"$f":"'Input Screen'!$C$8*5280*$AU$4*'Input Screen'!$C$9*2*(T32-$T$6)/12*0.0575","v":{"$error":"#DIV/0!"}},{"$error":"#DIV/0!"},{"$f":"AS32/($AU$4*'Input Screen'!$C$8)","v":{"$error":"#DIV/0!"}},{"$error":"#DIV/0!"},{"$error":"#DIV/0!"},{"$f":"AS32*'Input Screen'!$C$21/1000000","v":{"$error":"#DIV/0!"}},null,null,null,null,null,null,null,null,null,null,null,null,null,null,null,null,null,null,null,null,null,null,null,null,null,null,null,null,null,null,null,null,null,null,null,null,null,null,null,null,null,null,null,null,null,null,null,null,null,null,null,null,null,null,"Decatur",5.2087195363898246E-3,45,1.31,2]
[null,null,null,null,null,null,null,null,null,null,null,null,null,null,null,null,null,null,null,{"$error":"#DIV/0!"},{"$f":"'Input Screen'!$C$8*5280*'Input Screen'!$C$9*2*(T33-$T$6)/12*0.0575","v":{"$error":"#DIV/0!"}},{"$f":"U33/'Input Screen'!$C$8","v":{"$error":"#DIV/0!"}},{"$error":"#DIV/0!"},{"$error":"#DIV/0!"},{"$f":"U33*'Input Screen'!$C$21/1000000","v":{"$error":"#DIV/0!"}},2.8000000000000012,{"$error":"#VALUE!"},{"$error":"#VALUE!"},null,null,null,null,null,null,null,null,null,null,null,null,null,null,null,null,{"$f":"'Input Screen'!$C$8*5280*$AU$4*'Input Screen'!$C$9*2*(T33-$T$6)/12*0.0575","v":{"$error":"#DIV/0!"}},{"$error":"#DIV/0!"},{"$f":"AS33/($AU$4*'Input Screen'!$C$8)","v":{"$error":"#DIV/0!"}},{"$error":"#DIV/0!"},{"$error":"#DIV/0!"},{"$f":"AS33*'Input Screen'!$C$21/1000000","v":{"$error":"#DIV/0!"}},null,null,null,null,null,null,null,null,null,null,null,null,null,null,null,null,null,null,null,null,null,null,null,null,null,null,null,null,null,null,null,null,null,null,null,null,null,null,null,null,null,null,null,null,null,null,null,null,null,null,null,null,null,null,"Delaware",4.9975575750721138E-3,59,1.85,3]
[null,null,null,null,null,null,null,null,null,null,null,null,null,null,null,null,null,null,null,{"$error":"#DIV/0!"},{"$f":"'Input Screen'!$C$8*5280*'Input Screen'!$C$9*2*(T34-$T$6)/12*0.0575","v":{"$error":"#DIV/0!"}},{"$f":"U34/'Input Screen'!$C$8","v":{"$error":"#DIV/0!"}},{"$error":"#DIV/0!"},{"$error":"#DIV/0!"},{"$f":"U34*'Input Screen'!$C$21/1000000","v":{"$error":"#DIV/0!"}},2.9000000000000012,{"$error":"#VALUE!"},{"$error":"#VALUE!"},null,null,null,null,null,null,null,null,null,null,null,null,null,null,null,null,{"$f":"'Input Screen'!$C$8*5280*$AU$4*'Input Screen'!$C$9*2*(T34-$T$6)/12*0.0575","v":{"$error":"#DIV/0!"}},{"$error":"#DIV/0!"},{"$f":"AS34/($AU$4*'Input Screen'!$C$8)","v":{"$error":"#DIV/0!"}},{"$error":"#DIV/0!"},{"$error":"#DIV/0!"},{"$f":"AS34*'Input Screen'!$C$21/1000000","v":{"$error":"#DIV/0!"}},null,null,null,null,null,null,null,null,null,null,null,null,null,null,null,null,null,null,null,null,null,null,null,null,null,null,null,null,null,null,null,null,null,null,null,null,null,null,null,null,null,null,null,null,null,null,null,null,null,null,null,null,null,null,"Des Moines",5.4124968772397775E-3,86,1.41,1]
[null,null,null,null,null,null,null,null,null,null,null,null,null,null,null,null,null,null,null,{"$error":"#DIV/0!"},{"$f":"'Input Screen'!$C$8*5280*'Input Screen'!$C$9*2*(T35-$T$6)/12*0.0575","v":{"$error":"#DIV/0!"}},{"$f":"U35/'Input Screen'!$C$8","v":{"$error":"#DIV/0!"}},{"$error":"#DIV/0!"},{"$error":"#DIV/0!"},{"$f":"U35*'Input Screen'!$C$21/1000000","v":{"$error":"#DIV/0!"}},3.0000000000000013,{"$error":"#VALUE!"},{"$error":"#VALUE!"},null,null,null,null,null,null,null,null,null,null,null,null,null,null,null,null,{"$f":"'Input Screen'!$C$8*5280*$AU$4*'Input Screen'!$C$9*2*(T35-$T$6)/12*0.0575","v":{"$error":"#DIV/0!"}},{"$error":"#DIV/0!"},{"$f":"AS35/($AU$4*'Input Screen'!$C$8)","v":{"$error":"#DIV/0!"}},{"$error":"#DIV/0!"},{"$error":"#DIV/0!"},{"$f":"AS35*'Input Screen'!$C$21/1000000","v":{"$error":"#DIV/0!"}},null,null,null,null,null,null,null,null,null,null,null,null,null,null,null,null,null,null,null,null,null,null,null,null,null,null,null,null,null,null,null,null,null,null,null,null,null,null,null,null,null,null,null,null,null,null,null,null,null,null,null,null,null,null,"Dickinson",4.639863791435204E-3,46,1.75,4]
[null,null,null,null,null,null,null,null,null,null,null,null,null,null,null,null,null,null,null,{"$error":"#DIV/0!"},{"$f":"'Input Screen'!$C$8*5280*'Input Screen'!$C$9*2*(T36-$T$6)/12*0.0575","v":{"$error":"#DIV/0!"}},{"$f":"U36/'Input Screen'!$C$8","v":{"$error":"#DIV/0!"}},{"$error":"#DIV/0!"},{"$error":"#DIV/0!"},{"$f":"U36*'Input Screen'!$C$21/1000000","v":{"$error":"#DIV/0!"}},3.1000000000000014,{"$error":"#VALUE!"},{"$error":"#VALUE!"},null,null,null,null,null,null,null,null,null,null,null,null,null,null,null,null,{"$f":"'Input Screen'!$C$8*5280*$AU$4*'Input Screen'!$C$9*2*(T36-$T$6)/12*0.0575","v":{"$error":"#DIV/0!"}},{"$error":"#DIV/0!"},{"$f":"AS36/($AU$4*'Input Screen'!$C$8)","v":{"$error":"#DIV/0!"}},{"$error":"#DIV/0!"},{"$error":"#DIV/0!"},{"$f":"AS36*'Input Screen'!$C$21/1000000","v":{"$error":"#DIV/0!"}},null,null,null,null,null,null,null,null,null,null,null,null,null,null,null,null,null,null,null,null,null,null,null,null,null,null,null,null,null,null,null,null,null,null,null,null,null,null,null,null,null,null,null,null,null,null,null,null,null,null,null,null,null,null,"Dubuque",5.1061505632462537E-3,95,1.63,1]
[null,null,null,null,null,null,null,null,null,null,null,null,null,null,null,null,null,null,null,{"$error":"#DIV/0!"},{"$f":"'Input Screen'!$C$8*5280*'Input Screen'!$C$9*2*(T37-$T$6)/12*0.0575","v":{"$error":"#DIV/0!"}},{"$f":"U37/'Input Screen'!$C$8","v":{"$error":"#DIV/0!"}},{"$error":"#DIV/0!"},{"$error":"#DIV/0!"},{"$f":"U37*'Input Screen'!$C$21/1000000","v":{"$error":"#DIV/0!"}},3.2000000000000015,{"$error":"#VALUE!"},{"$error":"#VALUE!"},null,null,null,null,null,null,null,null,null,null,null,null,null,null,null,null,{"$f":"'Input Screen'!$C$8*5280*$AU$4*'Input Screen'!$C$9*2*(T37-$T$6)/12*0.0575","v":{"$error":"#DIV/0!"}},{"$error":"#DIV/0!"},{"$f":"AS37/($AU$4*'Input Screen'!$C$8)","v":{"$error":"#DIV/0!"}},{"$error":"#DIV/0!"},{"$error":"#DIV/0!"},{"$f":"AS37*'Input Screen'!$C$21/1000000","v":{"$error":"#DIV/0!"}},null,null,null,null,null,null,null,null,null,null,null,null,null,null,null,null,null,null,null,null,null,null,null,null,null,null,null,null,null,null,null,null,null,null,null,null,null,null,null,null,null,null,null,null,null,null,null,null,null,null,null,null,null,null,"Emmet",4.639863791435204E-3,31,1.97,4]
[null,null,null,null,null,null,null,null,null,null,null,null,null,null,null,null,null,null,null,{"$error":"#DIV/0!"},{"$f":"'Input Screen'!$C$8*5280*'Input Screen'!$C$9*2*(T38-$T$6)/12*0.0575","v":{"$error":"#DIV/0!"}},{"$f":"U38/'Input Screen'!$C$8","v":{"$error":"#DIV/0!"}},{"$error":"#DIV/0!"},{"$error":"#DIV/0!"},{"$f":"U38*'Input Screen'!$C$21/1000000","v":{"$error":"#DIV/0!"}},3.3000000000000016,{"$error":"#VALUE!"},{"$error":"#VALUE!"},null,null,null,null,null,null,null,null,null,null,null,null,null,null,null,null,{"$f":"'Input Screen'!$C$8*5280*$AU$4*'Input Screen'!$C$9*2*(T38-$T$6)/12*0.0575","v":{"$error":"#DIV/0!"}},{"$error":"#DIV/0!"},{"$f":"AS38/($AU$4*'Input Screen'!$C$8)","v":{"$error":"#DIV/0!"}},{"$error":"#DIV/0!"},{"$error":"#DIV/0!"},{"$f":"AS38*'Input Screen'!$C$21/1000000","v":{"$error":"#DIV/0!"}},null,null,null,null,null,null,null,null,null,null,null,null,null,null,null,null,null,null,null,null,null,null,null,null,null,null,null,null,null,null,null,null,null,null,null,null,null,null,null,null,null,null,null,null,null,null,null,null,null,null,null,null,null,null,"Fayette",5.1003203071161149E-3,49,1.51,2]
[null,null,null,null,null,null,null,null,null,null,null,null,null,null,null,null,null,null,null,{"$error":"#DIV/0!"},{"$f":"'Input Screen'!$C$8*5280*'Input Screen'!$C$9*2*(T39-$T$6)/12*0.0575","v":{"$error":"#DIV/0!"}},{"$f":"U39/'Input Screen'!$C$8","v":{"$error":"#DIV/0!"}},{"$error":"#DIV/0!"},{"$error":"#DIV/0!"},{"$f":"U39*'Input Screen'!$C$21/1000000","v":{"$error":"#DIV/0!"}},3.4000000000000017,{"$error":"#VALUE!"},{"$error":"#VALUE!"},null,null,null,null,null,null,null,null,null,null,null,null,null,null,null,null,{"$f":"'Input Screen'!$C$8*5280*$AU$4*'Input Screen'!$C$9*2*(T39-$T$6)/12*0.0575","v":{"$error":"#DIV/0!"}},{"$error":"#DIV/0!"},{"$f":"AS39/($AU$4*'Input Screen'!$C$8)","v":{"$error":"#DIV/0!"}},{"$error":"#DIV/0!"},{"$error":"#DIV/0!"},{"$f":"AS39*'Input Screen'!$C$21/1000000","v":{"$error":"#DIV/0!"}},null,null,null,null,null,null,null,null,null,null,null,null,null,null,null,null,null,null,null,null,null,null,null,null,null,null,null,null,null,null,null,null,null,null,null,null,null,null,null,null,null,null,null,null,null,null,null,null,null,null,null,null,null,null,"Floyd",5.0622299910157934E-3,49,2.0699999999999998,3]
[null,null,null,null,null,null,null,null,null,null,null,null,null,null,null,null,null,null,null,{"$error":"#DIV/0!"},{"$f":"'Input Screen'!$C$8*5280*'Input Screen'!$C$9*2*(T40-$T$6)/12*0.0575","v":{"$error":"#DIV/0!"}},{"$f":"U40/'Input Screen'!$C$8","v":{"$error":"#DIV/0!"}},{"$error":"#DIV/0!"},{"$error":"#DIV/0!"},{"$f":"U40*'Input Screen'!$C$21/1000000","v":{"$error":"#DIV/0!"}},3.5000000000000018,{"$error":"#VALUE!"},{"$error":"#VALUE!"},null,null,null,null,null,null,null,null,null,null,null,null,null,null,null,null,{"$f":"'Input Screen'!$C$8*5280*$AU$4*'Input Screen'!$C$9*2*(T40-$T$6)/12*0.0575","v":{"$error":"#DIV/0!"}},{"$error":"#DIV/0!"},{"$f":"AS40/($AU$4*'Input Screen'!$C$8)","v":{"$error":"#DIV/0!"}},{"$error":"#DIV/0!"},{"$error":"#DIV/0!"},{"$f":"AS40*'Input Screen'!$C$21/1000000","v":{"$error":"#DIV/0!"}},null,null,null,null,null,null,null,null,null,null,null,null,null,null,null,null,null,null,null,null,null,null,null,null,null,null,null,null,null,null,null,null,null,null,null,null,null,null,null,null,null,null,null,null,null,null,null,null,null,null,null,null,null,null,"Franklin",4.8691505265908526E-3,39,1.42,3]
[null,null,null,null,null,null,null,null,null,null,null,null,null,null,null,null,null,null,null,{"$error":"#DIV/0!"},{"$f":"'Input Screen'!$C$8*5280*'Input Screen'!$C$9*2*(T41-$T$6)/12*0.0575","v":{"$error":"#DIV/0!"}},{"$f":"U41/'Input Screen'!$C$8","v":{"$error":"#DIV/0!"}},{"$error":"#DIV/0!"},{"$error":"#DIV/0!"},{"$f":"U41*'Input Screen'!$C$21/1000000","v":{"$error":"#DIV/0!"}},3.6000000000000019,{"$error":"#VALUE!"},{"$error":"#VALUE!"},null,null,null,null,null,null,null,null,null,null,null,null,null,null,null,null,{"$f":"'Input Screen'!$C$8*5280*$AU$4*'Input Screen'!$C$9*2*(T41-$T$6)/12*0.0575","v":{"$error":"#DIV/0!"}},{"$error":"#DIV/0!"},{"$f":"AS41/($AU$4*'Input Screen'!$C$8)","v":{"$error":"#DIV/0!"}},{"$error":"#DIV/0!"},{"$error":"#DIV/0!"},{"$f":"AS41*'Input Screen'!$C$21/1000000","v":{"$error":"#DIV/0!"}},null,null,null,null,null,null,null,null,null,null,null,null,null,null,null,null,null,null,null,null,null,null,null,null,null,null,null,null,null,null,null,null,null,null,null,null,null,null,null,null,null,null,null,null,null,null,null,null,null,null,null,null,null,null,"Fremont",4.4977026909159418E-3,44,1.55,4]
[null,null,null,null,null,null,null,null,null,null,null,null,null,null,null,null,null,null,null,{"$error":"#DIV/0!"},{"$f":"'Input Screen'!$C$8*5280*'Input Screen'!$C$9*2*(T42-$T$6)/12*0.0575","v":{"$error":"#DIV/0!"}},{"$f":"U42/'Input Screen'!$C$8","v":{"$error":"#DIV/0!"}},{"$error":"#DIV/0!"},{"$error":"#DIV/0!"},{"$f":"U42*'Input Screen'!$C$21/1000000","v":{"$error":"#DIV/0!"}},3.700000000000002,{"$error":"#VALUE!"},{"$error":"#VALUE!"},null,null,null,null,null,null,null,null,null,null,null,null,null,null,null,null,{"$f":"'Input Screen'!$C$8*5280*$AU$4*'Input Screen'!$C$9*2*(T42-$T$6)/12*0.0575","v":{"$error":"#DIV/0!"}},{"$error":"#DIV/0!"},{"$f":"AS42/($AU$4*'Input Screen'!$C$8)","v":{"$error":"#DIV/0!"}},{"$error":"#DIV/0!"},{"$error":"#DIV/0!"},{"$f":"AS42*'Input Screen'!$C$21/1000000","v":{"$error":"#DIV/0!"}},null,null,null,null,null,null,null,null,null,null,null,null,null,null,null,null,null,null,null,null,null,null,null,null,null,null,null,null,null,null,null,null,null,null,null,null,null,null,null,null,null,null,null,null,null,null,null,null,null,null,null,null,null,null,"Greene",4.974451273316435E-3,32,2.09,4]
[null,null,null,null,null,null,null,null,null,null,null,null,null,null,null,null,null,null,null,{"$error":"#DIV/0!"},{"$f":"'Input Screen'!$C$8*5280*'Input Screen'!$C$9*2*(T43-$T$6)/12*0.0575","v":{"$error":"#DIV/0!"}},{"$f":"U43/'Input Screen'!$C$8","v":{"$error":"#DIV/0!"}},{"$error":"#DIV/0!"},{"$error":"#DIV/0!"},{"$f":"U43*'Input Screen'!$C$21/1000000","v":{"$error":"#DIV/0!"}},3.800000000000002,{"$error":"#VALUE!"},{"$error":"#VALUE!"},null,null,null,null,null,null,null,null,null,null,null,null,null,null,null,null,{"$f":"'Input Screen'!$C$8*5280*$AU$4*'Input Screen'!$C$9*2*(T43-$T$6)/12*0.0575","v":{"$error":"#DIV/0!"}},{"$error":"#DIV/0!"},{"$f":"AS43/($AU$4*'Input Screen'!$C$8)","v":{"$error":"#DIV/0!"}},{"$error":"#DIV/0!"},{"$error":"#DIV/0!"},{"$f":"AS43*'Input Screen'!$C$21/1000000","v":{"$error":"#DIV/0!"}},null,null,null,null,null,null,null,null,null,null,null,null,null,null,null,null,null,null,null,null,null,null,null,null,null,null,null,null,null,null,null,null,null,null,null,null,null,null,null,null,null,null,null,null,null,null,null,null,null,null,null,null,null,null,"Grundy",4.9792338641866185E-3,46,1.75,3]
[null,null,null,null,null,null,null,null,null,null,null,null,null,null,null,null,null,null,null,{"$error":"#DIV/0!"},{"$f":"'Input Screen'!$C$8*5280*'Input Screen'!$C$9*2*(T44-$T$6)/12*0.0575","v":{"$error":"#DIV/0!"}},{"$f":"U44/'Input Screen'!$C$8","v":{"$error":"#DIV/0!"}},{"$error":"#DIV/0!"},{"$error":"#DIV/0!"},{"$f":"U44*'Input Screen'!$C$21/1000000","v":{"$error":"#DIV/0!"}},3.9000000000000021,{"$error":"#VALUE!"},{"$error":"#VALUE!"},null,null,null,null,null,null,null,null,null,null,null,null,null,null,null,null,{"$f":"'Input Screen'!$C$8*5280*$AU$4*'Input Screen'!$C$9*2*(T44-$T$6)/12*0.0575","v":{"$error":"#DIV/0!"}},{"$error":"#DIV/0!"},{"$f":"AS44/($AU$4*'Input Screen'!$C$8)","v":{"$error":"#DIV/0!"}},{"$error":"#DIV/0!"},{"$error":"#DIV/0!"},{"$f":"AS44*'Input Screen'!$C$21/1000000","v":{"$error":"#DIV/0!"}},null,null,null,null,null,null,null,null,null,null,null,null,null,null,null,null,null,null,null,null,null,null,null,null,null,null,null,null,null,null,null,null,null,null,null,null,null,null,null,null,null,null,null,null,null,null,null,null,null,null,null,null,null,null,"Guthrie",5.0309823365671004E-3,41,1.72,3]
[null,null,null,null,null,null,null,null,null,null,null,null,null,null,null,null,null,null,null,{"$error":"#DIV/0!"},{"$f":"'Input Screen'!$C$8*5280*'Input Screen'!$C$9*2*(T45-$T$6)/12*0.0575","v":{"$error":"#DIV/0!"}},{"$f":"U45/'Input Screen'!$C$8","v":{"$error":"#DIV/0!"}},{"$error":"#DIV/0!"},{"$error":"#DIV/0!"},{"$f":"U45*'Input Screen'!$C$21/1000000","v":{"$error":"#DIV/0!"}},4.0000000000000018,{"$error":"#VALUE!"},{"$error":"#VALUE!"},null,null,null,null,null,null,null,null,null,null,null,null,null,null,null,null,{"$f":"'Input Screen'!$C$8*5280*$AU$4*'Input Screen'!$C$9*2*(T45-$T$6)/12*0.0575","v":{"$error":"#DIV/0!"}},{"$error":"#DIV/0!"},{"$f":"AS45/($AU$4*'Input Screen'!$C$8)","v":{"$error":"#DIV/0!"}},{"$error":"#DIV/0!"},{"$error":"#DIV/0!"},{"$f":"AS45*'Input Screen'!$C$21/1000000","v":{"$error":"#DIV/0!"}},null,null,null,null,null,null,null,null,null,null,null,null,null,null,null,null,null,null,null,null,null,null,null,null,null,null,null,null,null,null,null,null,null,null,null,null,null,null,null,null,null,null,null,null,null,null,null,null,null,null,null,null,null,null,"Hamilton",4.8210041292498403E-3,40,2.04,4]
[null,null,null,null,null,null,null,null,null,null,null,null,null,null,null,null,null,null,null,{"$error":"#DIV/0!"},{"$f":"'Input Screen'!$C$8*5280*'Input Screen'!$C$9*2*(T46-$T$6)/12*0.0575","v":{"$error":"#DIV/0!"}},{"$f":"U46/'Input Screen'!$C$8","v":{"$error":"#DIV/0!"}},{"$error":"#DIV/0!"},{"$error":"#DIV/0!"},{"$f":"U46*'Input Screen'!$C$21/1000000","v":{"$error":"#DIV/0!"}},4.1000000000000014,{"$error":"#VALUE!"},{"$error":"#VALUE!"},null,null,null,null,null,null,null,null,null,null,null,null,null,null,null,null,{"$f":"'Input Screen'!$C$8*5280*$AU$4*'Input Screen'!$C$9*2*(T46-$T$6)/12*0.0575","v":{"$error":"#DIV/0!"}},{"$error":"#DIV/0!"},{"$f":"AS46/($AU$4*'Input Screen'!$C$8)","v":{"$error":"#DIV/0!"}},{"$error":"#DIV/0!"},{"$error":"#DIV/0!"},{"$f":"AS46*'Input Screen'!$C$21/1000000","v":{"$error":"#DIV/0!"}},null,null,null,null,null,null,null,null,null,null,null,null,null,null,null,null,null,null,null,null,null,null,null,null,null,null,null,null,null,null,null,null,null,null,null,null,null,null,null,null,null,null,null,null,null,null,null,null,null,null,null,null,null,null,"Hancock",4.7807792934514244E-3,38,1.97,4]
[null,null,null,null,null,null,null,null,null,null,null,null,null,null,null,null,null,null,null,{"$error":"#DIV/0!"},{"$f":"'Input Screen'!$C$8*5280*'Input Screen'!$C$9*2*(T47-$T$6)/12*0.0575","v":{"$error":"#DIV/0!"}},{"$f":"U47/'Input Screen'!$C$8","v":{"$error":"#DIV/0!"}},{"$error":"#DIV/0!"},{"$error":"#DIV/0!"},{"$f":"U47*'Input Screen'!$C$21/1000000","v":{"$error":"#DIV/0!"}},4.2000000000000011,{"$error":"#VALUE!"},{"$error":"#VALUE!"},null,null,null,null,null,null,null,null,null,null,null,null,null,null,null,null,{"$f":"'Input Screen'!$C$8*5280*$AU$4*'Input Screen'!$C$9*2*(T47-$T$6)/12*0.0575","v":{"$error":"#DIV/0!"}},{"$error":"#DIV/0!"},{"$f":"AS47/($AU$4*'Input Screen'!$C$8)","v":{"$error":"#DIV/0!"}},{"$error":"#DIV/0!"},{"$error":"#DIV/0!"},{"$f":"AS47*'Input Screen'!$C$21/1000000","v":{"$error":"#DIV/0!"}},null,null,null,null,null,null,null,null,null,null,null,null,null,null,null,null,null,null,null,null,null,null,null,null,null,null,null,null,null,null,null,null,null,null,null,null,null,null,null,null,null,null,null,null,null,null,null,null,null,null,null,null,null,null,"Hardin",5.0132026172963326E-3,46,1.84,3]
[null,null,null,null,null,null,null,null,null,null,null,null,null,null,null,null,null,null,null,{"$error":"#DIV/0!"},{"$f":"'Input Screen'!$C$8*5280*'Input Screen'!$C$9*2*(T48-$T$6)/12*0.0575","v":{"$error":"#DIV/0!"}},{"$f":"U48/'Input Screen'!$C$8","v":{"$error":"#DIV/0!"}},{"$error":"#DIV/0!"},{"$error":"#DIV/0!"},{"$f":"U48*'Input Screen'!$C$21/1000000","v":{"$error":"#DIV/0!"}},4.3000000000000007,{"$error":"#VALUE!"},{"$error":"#VALUE!"},null,null,null,null,null,null,null,null,null,null,null,null,null,null,null,null,{"$f":"'Input Screen'!$C$8*5280*$AU$4*'Input Screen'!$C$9*2*(T48-$T$6)/12*0.0575","v":{"$error":"#DIV/0!"}},{"$error":"#DIV/0!"},{"$f":"AS48/($AU$4*'Input Screen'!$C$8)","v":{"$error":"#DIV/0!"}},{"$error":"#DIV/0!"},{"$error":"#DIV/0!"},{"$f":"AS48*'Input Screen'!$C$21/1000000","v":{"$error":"#DIV/0!"}},null,null,null,null,null,null,null,null,null,null,null,null,null,null,null,null,null,null,null,null,null,null,null,null,null,null,null,null,null,null,null,null,null,null,null,null,null,null,null,null,null,null,null,null,null,null,null,null,null,null,null,null,null,null,"Harrison",4.7434149249136305E-3,46,1.54,3]
[null,null,null,null,null,null,null,null,null,null,null,null,null,null,null,null,null,null,null,{"$error":"#DIV/0!"},{"$f":"'Input Screen'!$C$8*5280*'Input Screen'!$C$9*2*(T49-$T$6)/12*0.0575","v":{"$error":"#DIV/0!"}},{"$f":"U49/'Input Screen'!$C$8","v":{"$error":"#DIV/0!"}},{"$error":"#DIV/0!"},{"$error":"#DIV/0!"},{"$f":"U49*'Input Screen'!$C$21/1000000","v":{"$error":"#DIV/0!"}},4.4000000000000004,{"$error":"#VALUE!"},{"$error":"#VALUE!"},null,null,null,null,null,null,null,null,null,null,null,null,null,null,null,null,{"$f":"'Input Screen'!$C$8*5280*$AU$4*'Input Screen'!$C$9*2*(T49-$T$6)/12*0.0575","v":{"$error":"#DIV/0!"}},{"$error":"#DIV/0!"},{"$f":"AS49/($AU$4*'Input Screen'!$C$8)","v":{"$error":"#DIV/0!"}},{"$error":"#DIV/0!"},{"$error":"#DIV/0!"},{"$f":"AS49*'Input Screen'!$C$21/1000000","v":{"$error":"#DIV/0!"}},null,null,null,null,null,null,null,null,null,null,null,null,null,null,null,null,null,null,null,null,null,null,null,null,null,null,null,null,null,null,null,null,null,null,null,null,null,null,null,null,null,null,null,null,null,null,null,null,null,null,null,null,null,null,"Henry",5.2756519674566774E-3,69,1.45,1]
[null,null,null,null,null,null,null,null,null,null,null,null,null,null,null,null,null,null,null,{"$error":"#DIV/0!"},{"$f":"'Input Screen'!$C$8*5280*'Input Screen'!$C$9*2*(T50-$T$6)/12*0.0575","v":{"$error":"#DIV/0!"}},{"$f":"U50/'Input Screen'!$C$8","v":{"$error":"#DIV/0!"}},{"$error":"#DIV/0!"},{"$error":"#DIV/0!"},{"$f":"U50*'Input Screen'!$C$21/1000000","v":{"$error":"#DIV/0!"}},4.5,{"$error":"#VALUE!"},{"$error":"#VALUE!"},null,null,null,null,null,null,null,null,null,null,null,null,null,null,null,null,{"$f":"'Input Screen'!$C$8*5280*$AU$4*'Input Screen'!$C$9*2*(T50-$T$6)/12*0.0575","v":{"$error":"#DIV/0!"}},{"$error":"#DIV/0!"},{"$f":"AS50/($AU$4*'Input Screen'!$C$8)","v":{"$error":"#DIV/0!"}},{"$error":"#DIV/0!"},{"$error":"#DIV/0!"},{"$f":"AS50*'Input Screen'!$C$21/1000000","v":{"$error":"#DIV/0!"}},null,null,null,null,null,null,null,null,null,null,null,null,null,null,null,null,null,null,null,null,null,null,null,null,null,null,null,null,null,null,null,null,null,null,null,null,null,null,null,null,null,null,null,null,null,null,null,null,null,null,null,null,null,null,"Howard",5.184884693676766E-3,53,1.97,3]
[null,null,null,null,null,null,null,null,null,null,null,null,null,null,null,null,null,null,null,{"$error":"#DIV/0!"},{"$f":"'Input Screen'!$C$8*5280*'Input Screen'!$C$9*2*(T51-$T$6)/12*0.0575","v":{"$error":"#DIV/0!"}},{"$f":"U51/'Input Screen'!$C$8","v":{"$error":"#DIV/0!"}},{"$error":"#DIV/0!"},{"$error":"#DIV/0!"},{"$f":"U51*'Input Screen'!$C$21/1000000","v":{"$error":"#DIV/0!"}},4.5999999999999996,{"$error":"#VALUE!"},{"$error":"#VALUE!"},null,null,null,null,null,null,null,null,null,null,null,null,null,null,null,null,{"$f":"'Input Screen'!$C$8*5280*$AU$4*'Input Screen'!$C$9*2*(T51-$T$6)/12*0.0575","v":{"$error":"#DIV/0!"}},{"$error":"#DIV/0!"},{"$f":"AS51/($AU$4*'Input Screen'!$C$8)","v":{"$error":"#DIV/0!"}},{"$error":"#DIV/0!"},{"$error":"#DIV/0!"},{"$f":"AS51*'Input Screen'!$C$21/1000000","v":{"$error":"#DIV/0!"}},null,null,null,null,null,null,null,null,null,null,null,null,null,null,null,null,null,null,null,null,null,null,null,null,null,null,null,null,null,null,null,null,null,null,null,null,null,null,null,null,null,null,null,null,null,null,null,null,null,null,null,null,null,null,"Humboldt",4.6417111430406034E-3,31,1.97,4]
[null,null,null,null,null,null,null,null,null,null,null,null,null,null,null,null,null,null,null,{"$error":"#DIV/0!"},{"$f":"'Input Screen'!$C$8*5280*'Input Screen'!$C$9*2*(T52-$T$6)/12*0.0575","v":{"$error":"#DIV/0!"}},{"$f":"U52/'Input Screen'!$C$8","v":{"$error":"#DIV/0!"}},{"$error":"#DIV/0!"},{"$error":"#DIV/0!"},{"$f":"U52*'Input Screen'!$C$21/1000000","v":{"$error":"#DIV/0!"}},4.6999999999999993,{"$error":"#VALUE!"},{"$error":"#VALUE!"},null,null,null,null,null,null,null,null,null,null,null,null,null,null,null,null,{"$f":"'Input Screen'!$C$8*5280*$AU$4*'Input Screen'!$C$9*2*(T52-$T$6)/12*0.0575","v":{"$error":"#DIV/0!"}},{"$error":"#DIV/0!"},{"$f":"AS52/($AU$4*'Input Screen'!$C$8)","v":{"$error":"#DIV/0!"}},{"$error":"#DIV/0!"},{"$error":"#DIV/0!"},{"$f":"AS52*'Input Screen'!$C$21/1000000","v":{"$error":"#DIV/0!"}},null,null,null,null,null,null,null,null,null,null,null,null,null,null,null,null,null,null,null,null,null,null,null,null,null,null,null,null,null,null,null,null,null,null,null,null,null,null,null,null,null,null,null,null,null,null,null,null,null,null,null,null,null,null,"Ida",4.4375674940068813E-3,33,1.41,4]
[null,null,null,null,null,null,null,null,null,null,null,null,null,null,null,null,null,null,null,{"$error":"#DIV/0!"},{"$f":"'Input Screen'!$C$8*5280*'Input Screen'!$C$9*2*(T53-$T$6)/12*0.0575","v":{"$error":"#DIV/0!"}},{"$f":"U53/'Input Screen'!$C$8","v":{"$error":"#DIV/0!"}},{"$error":"#DIV/0!"},{"$error":"#DIV/0!"},{"$f":"U53*'Input Screen'!$C$21/1000000","v":{"$error":"#DIV/0!"}},4.7999999999999989,{"$error":"#VALUE!"},{"$error":"#VALUE!"},null,null,null,null,null,null,null,null,null,null,null,null,null,null,null,null,{"$f":"'Input Screen'!$C$8*5280*$AU$4*'Input Screen'!$C$9*2*(T53-$T$6)/12*0.0575","v":{"$error":"#DIV/0!"}},{"$error":"#DIV/0!"},{"$f":"AS53/($AU$4*'Input Screen'!$C$8)","v":{"$error":"#DIV/0!"}},{"$error":"#DIV/0!"},{"$error":"#DIV/0!"},{"$f":"AS53*'Input Screen'!$C$21/1000000","v":{"$error":"#DIV/0!"}},null,null,null,null,null,null,null,null,null,null,null,null,null,null,null,null,null,null,null,null,null,null,null,null,null,null,null,null,null,null,null,null,null,null,null,null,null,null,null,null,null,null,null,null,null,null,null,null,null,null,null,null,null,null,"Iowa",5.1485074747975599E-3,60,1.4,2]
[null,null,null,null,null,null,null,null,null,null,null,null,null,null,null,null,null,null,null,{"$error":"#DIV/0!"},{"$f":"'Input Screen'!$C$8*5280*'Input Screen'!$C$9*2*(T54-$T$6)/12*0.0575","v":{"$error":"#DIV/0!"}},{"$f":"U54/'Input Screen'!$C$8","v":{"$error":"#DIV/0!"}},{"$error":"#DIV/0!"},{"$error":"#DIV/0!"},{"$f":"U54*'Input Screen'!$C$21/1000000","v":{"$error":"#DIV/0!"}},4.8999999999999986,{"$error":"#VALUE!"},{"$error":"#VALUE!"},null,null,null,null,null,null,null,null,null,null,null,null,null,null,null,null,{"$f":"'Input Screen'!$C$8*5280*$AU$4*'Input Screen'!$C$9*2*(T54-$T$6)/12*0.0575","v":{"$error":"#DIV/0!"}},{"$error":"#DIV/0!"},{"$f":"AS54/($AU$4*'Input Screen'!$C$8)","v":{"$error":"#DIV/0!"}},{"$error":"#DIV/0!"},{"$error":"#DIV/0!"},{"$f":"AS54*'Input Screen'!$C$21/1000000","v":{"$error":"#DIV/0!"}},null,null,null,null,null,null,null,null,null,null,null,null,null,null,null,null,null,null,null,null,null,null,null,null,null,null,null,null,null,null,null,null,null,null,null,null,null,null,null,null,null,null,null,null,null,null,null,null,null,null,null,null,null,null,"Jackson",5.1144031177202684E-3,69,1.6,2]
[null,null,null,null,null,null,null,null,null,null,null,null,null,null,null,null,null,null,null,{"$error":"#DIV/0!"},{"$f":"'Input Screen'!$C$8*5280*'Input Screen'!$C$9*2*(T55-$T$6)/12*0.0575","v":{"$error":"#DIV/0!"}},{"$f":"U55/'Input Screen'!$C$8","v":{"$error":"#DIV/0!"}},{"$error":"#DIV/0!"},{"$error":"#DIV/0!"},{"$f":"U55*'Input Screen'!$C$21/1000000","v":{"$error":"#DIV/0!"}},4.9999999999999982,{"$error":"#VALUE!"},{"$error":"#VALUE!"},null,null,null,null,null,null,null,null,null,null,null,null,null,null,null,null,{"$f":"'Input Screen'!$C$8*5280*$AU$4*'Input Screen'!$C$9*2*(T55-$T$6)/12*0.0575","v":{"$error":"#DIV/0!"}},{"$error":"#DIV/0!"},{"$f":"AS55/($AU$4*'Input Screen'!$C$8)","v":{"$error":"#DIV/0!"}},{"$error":"#DIV/0!"},{"$error":"#DIV/0!"},{"$f":"AS55*'Input Screen'!$C$21/1000000","v":{"$error":"#DIV/0!"}},null,null,null,null,null,null,null,null,null,null,null,null,null,null,null,null,null,null,null,null,null,null,null,null,null,null,null,null,null,null,null,null,null,null,null,null,null,null,null,null,null,null,null,null,null,null,null,null,null,null,null,null,null,null,"Jasper",5.1814634071846825E-3,71,1.34,1]
[null,null,null,null,null,null,null,null,null,null,null,null,null,null,null,null,null,null,null,{"$error":"#DIV/0!"},{"$f":"'Input Screen'!$C$8*5280*'Input Screen'!$C$9*2*(T56-$T$6)/12*0.0575","v":{"$error":"#DIV/0!"}},{"$f":"U56/'Input Screen'!$C$8","v":{"$error":"#DIV/0!"}},{"$error":"#DIV/0!"},{"$error":"#DIV/0!"},{"$f":"U56*'Input Screen'!$C$21/1000000","v":{"$error":"#DIV/0!"}},5.0999999999999979,{"$error":"#VALUE!"},{"$error":"#VALUE!"},null,null,null,null,null,null,null,null,null,null,null,null,null,null,null,null,{"$f":"'Input Screen'!$C$8*5280*$AU$4*'Input Screen'!$C$9*2*(T56-$T$6)/12*0.0575","v":{"$error":"#DIV/0!"}},{"$error":"#DIV/0!"},{"$f":"AS56/($AU$4*'Input Screen'!$C$8)","v":{"$error":"#DIV/0!"}},{"$error":"#DIV/0!"},{"$error":"#DIV/0!"},{"$f":"AS56*'Input Screen'!$C$21/1000000","v":{"$error":"#DIV/0!"}},null,null,null,null,null,null,null,null,null,null,null,null,null,null,null,null,null,null,null,null,null,null,null,null,null,null,null,null,null,null,null,null,null,null,null,null,null,null,null,null,null,null,null,null,null,null,null,null,null,null,null,null,null,null,"Jefferson",5.27565196745668E-3,52,1.3,1]
[null,null,null,null,null,null,null,null,null,null,null,null,null,null,null,null,null,null,null,{"$error":"#DIV/0!"},{"$f":"'Input Screen'!$C$8*5280*'Input Screen'!$C$9*2*(T57-$T$6)/12*0.0575","v":{"$error":"#DIV/0!"}},{"$f":"U57/'Input Screen'!$C$8","v":{"$error":"#DIV/0!"}},{"$error":"#DIV/0!"},{"$error":"#DIV/0!"},{"$f":"U57*'Input Screen'!$C$21/1000000","v":{"$error":"#DIV/0!"}},5.1999999999999975,{"$error":"#VALUE!"},{"$error":"#VALUE!"},null,null,null,null,null,null,null,null,null,null,null,null,null,null,null,null,{"$f":"'Input Screen'!$C$8*5280*$AU$4*'Input Screen'!$C$9*2*(T57-$T$6)/12*0.0575","v":{"$error":"#DIV/0!"}},{"$error":"#DIV/0!"},{"$f":"AS57/($AU$4*'Input Screen'!$C$8)","v":{"$error":"#DIV/0!"}},{"$error":"#DIV/0!"},{"$error":"#DIV/0!"},{"$f":"AS57*'Input Screen'!$C$21/1000000","v":{"$error":"#DIV/0!"}},null,null,null,null,null,null,null,null,null,null,null,null,null,null,null,null,null,null,null,null,null,null,null,null,null,null,null,null,null,null,null,null,null,null,null,null,null,null,null,null,null,null,null,null,null,null,null,null,null,null,null,null,null,null,"Johnson",5.1274035463285761E-3,93,1.73,1]
[null,null,null,null,null,null,null,null,null,null,null,null,null,null,null,null,null,null,null,{"$error":"#DIV/0!"},{"$f":"'Input Screen'!$C$8*5280*'Input Screen'!$C$9*2*(T58-$T$6)/12*0.0575","v":{"$error":"#DIV/0!"}},{"$f":"U58/'Input Screen'!$C$8","v":{"$error":"#DIV/0!"}},{"$error":"#DIV/0!"},{"$error":"#DIV/0!"},{"$f":"U58*'Input Screen'!$C$21/1000000","v":{"$error":"#DIV/0!"}},5.2999999999999972,{"$error":"#VALUE!"},{"$error":"#VALUE!"},null,null,null,null,null,null,null,null,null,null,null,null,null,null,null,null,{"$f":"'Input Screen'!$C$8*5280*$AU$4*'Input Screen'!$C$9*2*(T58-$T$6)/12*0.0575","v":{"$error":"#DIV/0!"}},{"$error":"#DIV/0!"},{"$f":"AS58/($AU$4*'Input Screen'!$C$8)","v":{"$error":"#DIV/0!"}},{"$error":"#DIV/0!"},{"$error":"#DIV/0!"},{"$f":"AS58*'Input Screen'!$C$21/1000000","v":{"$error":"#DIV/0!"}},null,null,null,null,null,null,null,null,null,null,null,null,null,null,null,null,null,null,null,null,null,null,null,null,null,null,null,null,null,null,null,null,null,null,null,null,null,null,null,null,null,null,null,null,null,null,null,null,null,null,null,null,null,null,"Jones",5.022163943148087E-3,60,1.86,3]
[null,null,null,null,null,null,null,null,null,null,null,null,null,null,null,null,null,null,null,{"$error":"#DIV/0!"},{"$f":"'Input Screen'!$C$8*5280*'Input Screen'!$C$9*2*(T59-$T$6)/12*0.0575","v":{"$error":"#DIV/0!"}},{"$f":"U59/'Input Screen'!$C$8","v":{"$error":"#DIV/0!"}},{"$error":"#DIV/0!"},{"$error":"#DIV/0!"},{"$f":"U59*'Input Screen'!$C$21/1000000","v":{"$error":"#DIV/0!"}},5.3999999999999968,{"$error":"#VALUE!"},{"$error":"#VALUE!"},null,null,null,null,null,null,null,null,null,null,null,null,null,null,null,null,{"$f":"'Input Screen'!$C$8*5280*$AU$4*'Input Screen'!$C$9*2*(T59-$T$6)/12*0.0575","v":{"$error":"#DIV/0!"}},{"$error":"#DIV/0!"},{"$f":"AS59/($AU$4*'Input Screen'!$C$8)","v":{"$error":"#DIV/0!"}},{"$error":"#DIV/0!"},{"$error":"#DIV/0!"},{"$f":"AS59*'Input Screen'!$C$21/1000000","v":{"$error":"#DIV/0!"}},null,null,null,null,null,null,null,null,null,null,null,null,null,null,null,null,null,null,null,null,null,null,null,null,null,null,null,null,null,null,null,null,null,null,null,null,null,null,null,null,null,null,null,null,null,null,null,null,null,null,null,null,null,null,"Keokuk",5.1274035463285796E-3,44,1.2,2]
[null,null,null,null,null,null,null,null,null,null,null,null,null,null,null,null,null,null,null,{"$error":"#DIV/0!"},{"$f":"'Input Screen'!$C$8*5280*'Input Screen'!$C$9*2*(T60-$T$6)/12*0.0575","v":{"$error":"#DIV/0!"}},{"$f":"U60/'Input Screen'!$C$8","v":{"$error":"#DIV/0!"}},{"$error":"#DIV/0!"},{"$error":"#DIV/0!"},{"$f":"U60*'Input Screen'!$C$21/1000000","v":{"$error":"#DIV/0!"}},5.4999999999999964,{"$error":"#VALUE!"},{"$error":"#VALUE!"},null,null,null,null,null,null,null,null,null,null,null,null,null,null,null,null,{"$f":"'Input Screen'!$C$8*5280*$AU$4*'Input Screen'!$C$9*2*(T60-$T$6)/12*0.0575","v":{"$error":"#DIV/0!"}},{"$error":"#DIV/0!"},{"$f":"AS60/($AU$4*'Input Screen'!$C$8)","v":{"$error":"#DIV/0!"}},{"$error":"#DIV/0!"},{"$error":"#DIV/0!"},{"$f":"AS60*'Input Screen'!$C$21/1000000","v":{"$error":"#DIV/0!"}},null,null,null,null,null,null,null,null,null,null,null,null,null,null,null,null,null,null,null,null,null,null,null,null,null,null,null,null,null,null,null,null,null,null,null,null,null,null,null,null,null,null,null,null,null,null,null,null,null,null,null,null,null,null,"Kossuth",4.6417111430406034E-3,31,2.0499999999999998,4]
[null,null,null,null,null,null,null,null,null,null,null,null,null,null,null,null,null,null,null,{"$error":"#DIV/0!"},{"$f":"'Input Screen'!$C$8*5280*'Input Screen'!$C$9*2*(T61-$T$6)/12*0.0575","v":{"$error":"#DIV/0!"}},{"$f":"U61/'Input Screen'!$C$8","v":{"$error":"#DIV/0!"}},{"$error":"#DIV/0!"},{"$error":"#DIV/0!"},{"$f":"U61*'Input Screen'!$C$21/1000000","v":{"$error":"#DIV/0!"}},5.5999999999999961,{"$error":"#VALUE!"},{"$error":"#VALUE!"},null,null,null,null,null,null,null,null,null,null,null,null,null,null,null,null,{"$f":"'Input Screen'!$C$8*5280*$AU$4*'Input Screen'!$C$9*2*(T61-$T$6)/12*0.0575","v":{"$error":"#DIV/0!"}},{"$error":"#DIV/0!"},{"$f":"AS61/($AU$4*'Input Screen'!$C$8)","v":{"$error":"#DIV/0!"}},{"$error":"#DIV/0!"},{"$error":"#DIV/0!"},{"$f":"AS61*'Input Screen'!$C$21/1000000","v":{"$error":"#DIV/0!"}},null,null,null,null,null,null,null,null,null,null,null,null,null,null,null,null,null,null,null,null,null,null,null,null,null,null,null,null,null,null,null,null,null,null,null,null,null,null,null,null,null,null,null,null,null,null,null,null,null,null,null,null,null,null,"Lee",5.3359785518334799E-3,84,1.2,1]
[null,null,null,null,null,null,null,null,null,null,null,null,null,null,null,null,null,null,null,{"$error":"#DIV/0!"},{"$f":"'Input Screen'!$C$8*5280*'Input Screen'!$C$9*2*(T62-$T$6)/12*0.0575","v":{"$error":"#DIV/0!"}},{"$f":"U62/'Input Screen'!$C$8","v":{"$error":"#DIV/0!"}},{"$error":"#DIV/0!"},{"$error":"#DIV/0!"},{"$f":"U62*'Input Screen'!$C$21/1000000","v":{"$error":"#DIV/0!"}},5.6999999999999957,{"$error":"#VALUE!"},{"$error":"#VALUE!"},null,null,null,null,null,null,null,null,null,null,null,null,null,null,null,null,{"$f":"'Input Screen'!$C$8*5280*$AU$4*'Input Screen'!$C$9*2*(T62-$T$6)/12*0.0575","v":{"$error":"#DIV/0!"}},{"$error":"#DIV/0!"},{"$f":"AS62/($AU$4*'Input Screen'!$C$8)","v":{"$error":"#DIV/0!"}},{"$error":"#DIV/0!"},{"$error":"#DIV/0!"},{"$f":"AS62*'Input Screen'!$C$21/1000000","v":{"$error":"#DIV/0!"}},null,null,null,null,null,null,null,null,null,null,null,null,null,null,null,null,null,null,null,null,null,null,null,null,null,null,null,null,null,null,null,null,null,null,null,null,null,null,null,null,null,null,null,null,null,null,null,null,null,null,null,null,null,null,"Linn",5.022163943148087E-3,120,1.87,1]
[null,null,null,null,null,null,null,null,null,null,null,null,null,null,null,null,null,null,null,{"$error":"#DIV/0!"},{"$f":"'Input Screen'!$C$8*5280*'Input Screen'!$C$9*2*(T63-$T$6)/12*0.0575","v":{"$error":"#DIV/0!"}},{"$f":"U63/'Input Screen'!$C$8","v":{"$error":"#DIV/0!"}},{"$error":"#DIV/0!"},{"$error":"#DIV/0!"},{"$f":"U63*'Input Screen'!$C$21/1000000","v":{"$error":"#DIV/0!"}},5.7999999999999954,{"$error":"#VALUE!"},{"$error":"#VALUE!"},null,null,null,null,null,null,null,null,null,null,null,null,null,null,null,null,{"$f":"'Input Screen'!$C$8*5280*$AU$4*'Input Screen'!$C$9*2*(T63-$T$6)/12*0.0575","v":{"$error":"#DIV/0!"}},{"$error":"#DIV/0!"},{"$f":"AS63/($AU$4*'Input Screen'!$C$8)","v":{"$error":"#DIV/0!"}},{"$error":"#DIV/0!"},{"$error":"#DIV/0!"},{"$f":"AS63*'Input Screen'!$C$21/1000000","v":{"$error":"#DIV/0!"}},null,null,null,null,null,null,null,null,null,null,null,null,null,null,null,null,null,null,null,null,null,null,null,null,null,null,null,null,null,null,null,null,null,null,null,null,null,null,null,null,null,null,null,null,null,null,null,null,null,null,null,null,null,null,"Louisa",5.4124968772397775E-3,64,1.66,1]
[null,null,null,null,null,null,null,null,null,null,null,null,null,null,null,null,null,null,null,{"$error":"#DIV/0!"},{"$f":"'Input Screen'!$C$8*5280*'Input Screen'!$C$9*2*(T64-$T$6)/12*0.0575","v":{"$error":"#DIV/0!"}},{"$f":"U64/'Input Screen'!$C$8","v":{"$error":"#DIV/0!"}},{"$error":"#DIV/0!"},{"$error":"#DIV/0!"},{"$f":"U64*'Input Screen'!$C$21/1000000","v":{"$error":"#DIV/0!"}},5.899999999999995,{"$error":"#VALUE!"},{"$error":"#VALUE!"},null,null,null,null,null,null,null,null,null,null,null,null,null,null,null,null,{"$f":"'Input Screen'!$C$8*5280*$AU$4*'Input Screen'!$C$9*2*(T64-$T$6)/12*0.0575","v":{"$error":"#DIV/0!"}},{"$error":"#DIV/0!"},{"$f":"AS64/($AU$4*'Input Screen'!$C$8)","v":{"$error":"#DIV/0!"}},{"$error":"#DIV/0!"},{"$error":"#DIV/0!"},{"$f":"AS64*'Input Screen'!$C$21/1000000","v":{"$error":"#DIV/0!"}},null,null,null,null,null,null,null,null,null,null,null,null,null,null,null,null,null,null,null,null,null,null,null,null,null,null,null,null,null,null,null,null,null,null,null,null,null,null,null,null,null,null,null,null,null,null,null,null,null,null,null,null,null,null,"Lucas",5.0590186857513838E-3,52,1.17,1]
[null,null,null,null,null,null,null,null,null,null,null,null,null,null,null,null,null,null,null,{"$error":"#DIV/0!"},{"$f":"'Input Screen'!$C$8*5280*'Input Screen'!$C$9*2*(T65-$T$6)/12*0.0575","v":{"$error":"#DIV/0!"}},{"$f":"U65/'Input Screen'!$C$8","v":{"$error":"#DIV/0!"}},{"$error":"#DIV/0!"},{"$error":"#DIV/0!"},{"$f":"U65*'Input Screen'!$C$21/1000000","v":{"$error":"#DIV/0!"}},5.9999999999999947,{"$error":"#VALUE!"},{"$error":"#VALUE!"},null,null,null,null,null,null,null,null,null,null,null,null,null,null,null,null,{"$f":"'Input Screen'!$C$8*5280*$AU$4*'Input Screen'!$C$9*2*(T65-$T$6)/12*0.0575","v":{"$error":"#DIV/0!"}},{"$error":"#DIV/0!"},{"$f":"AS65/($AU$4*'Input Screen'!$C$8)","v":{"$error":"#DIV/0!"}},{"$error":"#DIV/0!"},{"$error":"#DIV/0!"},{"$f":"AS65*'Input Screen'!$C$21/1000000","v":{"$error":"#DIV/0!"}},null,null,null,null,null,null,null,null,null,null,null,null,null,null,null,null,null,null,null,null,null,null,null,null,null,null,null,null,null,null,null,null,null,null,null,null,null,null,null,null,null,null,null,null,null,null,null,null,null,null,null,null,null,null,"Lyon",4.1729683833969531E-3,38,1.53,4]
[null,null,null,null,null,null,null,null,null,null,null,null,null,null,null,null,null,null,null,{"$error":"#DIV/0!"},{"$f":"'Input Screen'!$C$8*5280*'Input Screen'!$C$9*2*(T66-$T$6)/12*0.0575","v":{"$error":"#DIV/0!"}},{"$f":"U66/'Input Screen'!$C$8","v":{"$error":"#DIV/0!"}},{"$error":"#DIV/0!"},{"$error":"#DIV/0!"},{"$f":"U66*'Input Screen'!$C$21/1000000","v":{"$error":"#DIV/0!"}},6.0999999999999943,{"$error":"#VALUE!"},{"$error":"#VALUE!"},null,null,null,null,null,null,null,null,null,null,null,null,null,null,null,null,{"$f":"'Input Screen'!$C$8*5280*$AU$4*'Input Screen'!$C$9*2*(T66-$T$6)/12*0.0575","v":{"$error":"#DIV/0!"}},{"$error":"#DIV/0!"},{"$f":"AS66/($AU$4*'Input Screen'!$C$8)","v":{"$error":"#DIV/0!"}},{"$error":"#DIV/0!"},{"$error":"#DIV/0!"},{"$f":"AS66*'Input Screen'!$C$21/1000000","v":{"$error":"#DIV/0!"}},null,null,null,null,null,null,null,null,null,null,null,null,null,null,null,null,null,null,null,null,null,null,null,null,null,null,null,null,null,null,null,null,null,null,null,null,null,null,null,null,null,null,null,null,null,null,null,null,null,null,null,null,null,null,"Madison",5.2099702299932956E-3,67,1.48,1]
[null,null,null,null,null,null,null,null,null,null,null,null,null,null,null,null,null,null,null,{"$error":"#DIV/0!"},{"$f":"'Input Screen'!$C$8*5280*'Input Screen'!$C$9*2*(T67-$T$6)/12*0.0575","v":{"$error":"#DIV/0!"}},{"$f":"U67/'Input Screen'!$C$8","v":{"$error":"#DIV/0!"}},{"$error":"#DIV/0!"},{"$error":"#DIV/0!"},{"$f":"U67*'Input Screen'!$C$21/1000000","v":{"$error":"#DIV/0!"}},6.199999999999994,{"$error":"#VALUE!"},{"$error":"#VALUE!"},null,null,null,null,null,null,null,null,null,null,null,null,null,null,null,null,{"$f":"'Input Screen'!$C$8*5280*$AU$4*'Input Screen'!$C$9*2*(T67-$T$6)/12*0.0575","v":{"$error":"#DIV/0!"}},{"$error":"#DIV/0!"},{"$f":"AS67/($AU$4*'Input Screen'!$C$8)","v":{"$error":"#DIV/0!"}},{"$error":"#DIV/0!"},{"$error":"#DIV/0!"},{"$f":"AS67*'Input Screen'!$C$21/1000000","v":{"$error":"#DIV/0!"}},null,null,null,null,null,null,null,null,null,null,null,null,null,null,null,null,null,null,null,null,null,null,null,null,null,null,null,null,null,null,null,null,null,null,null,null,null,null,null,null,null,null,null,null,null,null,null,null,null,null,null,null,null,null,"Mahaska",5.1485074747975599E-3,54,1.46,2]
[null,null,null,null,null,null,null,null,null,null,null,null,null,null,null,null,null,null,null,{"$error":"#DIV/0!"},{"$f":"'Input Screen'!$C$8*5280*'Input Screen'!$C$9*2*(T68-$T$6)/12*0.0575","v":{"$error":"#DIV/0!"}},{"$f":"U68/'Input Screen'!$C$8","v":{"$error":"#DIV/0!"}},{"$error":"#DIV/0!"},{"$error":"#DIV/0!"},{"$f":"U68*'Input Screen'!$C$21/1000000","v":{"$error":"#DIV/0!"}},6.2999999999999936,{"$error":"#VALUE!"},{"$error":"#VALUE!"},null,null,null,null,null,null,null,null,null,null,null,null,null,null,null,null,{"$f":"'Input Screen'!$C$8*5280*$AU$4*'Input Screen'!$C$9*2*(T68-$T$6)/12*0.0575","v":{"$error":"#DIV/0!"}},{"$error":"#DIV/0!"},{"$f":"AS68/($AU$4*'Input Screen'!$C$8)","v":{"$error":"#DIV/0!"}},{"$error":"#DIV/0!"},{"$error":"#DIV/0!"},{"$f":"AS68*'Input Screen'!$C$21/1000000","v":{"$error":"#DIV/0!"}},null,null,null,null,null,null,null,null,null,null,null,null,null,null,null,null,null,null,null,null,null,null,null,null,null,null,null,null,null,null,null,null,null,null,null,null,null,null,null,null,null,null,null,null,null,null,null,null,null,null,null,null,null,null,"Marion",5.1814634071846799E-3,68,1.1100000000000001,1]
[null,null,null,null,null,null,null,null,null,null,null,null,null,null,null,null,null,null,null,{"$error":"#DIV/0!"},{"$f":"'Input Screen'!$C$8*5280*'Input Screen'!$C$9*2*(T69-$T$6)/12*0.0575","v":{"$error":"#DIV/0!"}},{"$f":"U69/'Input Screen'!$C$8","v":{"$error":"#DIV/0!"}},{"$error":"#DIV/0!"},{"$error":"#DIV/0!"},{"$f":"U69*'Input Screen'!$C$21/1000000","v":{"$error":"#DIV/0!"}},6.3999999999999932,{"$error":"#VALUE!"},{"$error":"#VALUE!"},null,null,null,null,null,null,null,null,null,null,null,null,null,null,null,null,{"$f":"'Input Screen'!$C$8*5280*$AU$4*'Input Screen'!$C$9*2*(T69-$T$6)/12*0.0575","v":{"$error":"#DIV/0!"}},{"$error":"#DIV/0!"},{"$f":"AS69/($AU$4*'Input Screen'!$C$8)","v":{"$error":"#DIV/0!"}},{"$error":"#DIV/0!"},{"$error":"#DIV/0!"},{"$f":"AS69*'Input Screen'!$C$21/1000000","v":{"$error":"#DIV/0!"}},null,null,null,null,null,null,null,null,null,null,null,null,null,null,null,null,null,null,null,null,null,null,null,null,null,null,null,null,null,null,null,null,null,null,null,null,null,null,null,null,null,null,null,null,null,null,null,null,null,null,null,null,null,null,"Marshall",5.2629196432701355E-3,81,1.61,1]
[null,null,null,null,null,null,null,null,null,null,null,null,null,null,null,null,null,null,null,{"$error":"#DIV/0!"},{"$f":"'Input Screen'!$C$8*5280*'Input Screen'!$C$9*2*(T70-$T$6)/12*0.0575","v":{"$error":"#DIV/0!"}},{"$f":"U70/'Input Screen'!$C$8","v":{"$error":"#DIV/0!"}},{"$error":"#DIV/0!"},{"$error":"#DIV/0!"},{"$f":"U70*'Input Screen'!$C$21/1000000","v":{"$error":"#DIV/0!"}},6.4999999999999929,{"$error":"#VALUE!"},{"$error":"#VALUE!"},null,null,null,null,null,null,null,null,null,null,null,null,null,null,null,null,{"$f":"'Input Screen'!$C$8*5280*$AU$4*'Input Screen'!$C$9*2*(T70-$T$6)/12*0.0575","v":{"$error":"#DIV/0!"}},{"$error":"#DIV/0!"},{"$f":"AS70/($AU$4*'Input Screen'!$C$8)","v":{"$error":"#DIV/0!"}},{"$error":"#DIV/0!"},{"$error":"#DIV/0!"},{"$f":"AS70*'Input Screen'!$C$21/1000000","v":{"$error":"#DIV/0!"}},null,null,null,null,null,null,null,null,null,null,null,null,null,null,null,null,null,null,null,null,null,null,null,null,null,null,null,null,null,null,null,null,null,null,null,null,null,null,null,null,null,null,null,null,null,null,null,null,null,null,null,null,null,null,"Mills",4.4977026909159418E-3,64,1.34,3]
[null,null,null,null,null,null,null,null,null,null,null,null,null,null,null,null,null,null,null,{"$error":"#DIV/0!"},{"$f":"'Input Screen'!$C$8*5280*'Input Screen'!$C$9*2*(T71-$T$6)/12*0.0575","v":{"$error":"#DIV/0!"}},{"$f":"U71/'Input Screen'!$C$8","v":{"$error":"#DIV/0!"}},{"$f":"1-(_xlfn.NORM.S.DIST((T71-$BA$6)/((MAX($T$6:$T$306)-$BA$6)/6),TRUE))","v":{"$error":"#DIV/0!"}},{"$f":"U71*$R$6/1000000","v":{"$error":"#DIV/0!"}},{"$f":"U71*'Input Screen'!$C$21/1000000","v":{"$error":"#DIV/0!"}},6.5999999999999925,{"$f":"(_xlfn.WEIBULL.DIST(Z71,$M$6,$M$7,TRUE))","v":{"$error":"#VALUE!"}},{"$f":"1-AA71","v":{"$error":"#VALUE!"}},null,null,null,null,null,null,null,null,null,null,null,null,null,null,null,null,{"$f":"'Input Screen'!$C$8*5280*$AU$4*'Input Screen'!$C$9*2*(T71-$T$6)/12*0.0575","v":{"$error":"#DIV/0!"}},{"$error":"#DIV/0!"},{"$f":"AS71/($AU$4*'Input Screen'!$C$8)","v":{"$error":"#DIV/0!"}},{"$f":"1-(_xlfn.NORM.S.DIST((AT71-$BA$6)/((MAX($T$6:$T$306)-$BA$6)/6),TRUE))","v":{"$error":"#DIV/0!"}},{"$f":"AS71*$R$6/1000000","v":{"$error":"#DIV/0!"}},{"$f":"AS71*'Input Screen'!$C$21/1000000","v":{"$error":"#DIV/0!"}},null,null,null,null,null,null,null,null,null,null,null,null,null,null,null,null,null,null,null,null,null,null,null,null,null,null,null,null,null,null,null,null,null,null,null,null,null,null,null,null,null,null,null,null,null,null,null,null,null,null,null,null,null,null,"Mitchel",5.184884693676766E-3,51,1.91,3]
[null,null,null,null,null,null,null,null,null,null,null,null,null,null,null,null,null,null,null,{"$f":"IF(T71>=5,5,T71+0.01)","v":{"$error":"#DIV/0!"}},{"$f":"'Input Screen'!$C$8*5280*'Input Screen'!$C$9*2*(T72-$T$6)/12*0.0575","v":{"$error":"#DIV/0!"}},{"$f":"U72/'Input Screen'!$C$8","v":{"$error":"#DIV/0!"}},{"$error":"#DIV/0!"},{"$error":"#DIV/0!"},{"$f":"U72*'Input Screen'!$C$21/1000000","v":{"$error":"#DIV/0!"}},{"$f":"Z71+0.1","v":6.6999999999999922},{"$error":"#VALUE!"},{"$error":"#VALUE!"},null,null,null,null,null,null,null,null,null,null,null,null,null,null,null,null,{"$f":"'Input Screen'!$C$8*5280*$AU$4*'Input Screen'!$C$9*2*(T72-$T$6)/12*0.0575","v":{"$error":"#DIV/0!"}},{"$f":"IF(AT71>=5,5,AT71+0.01)","v":{"$error":"#DIV/0!"}},{"$f":"AS72/($AU$4*'Input Screen'!$C$8)","v":{"$error":"#DIV/0!"}},{"$error":"#DIV/0!"},{"$error":"#DIV/0!"},{"$f":"AS72*'Input Screen'!$C$21/1000000","v":{"$error":"#DIV/0!"}},null,null,null,null,null,null,null,null,null,null,null,null,null,null,null,null,null,null,null,null,null,null,null,null,null,null,null,null,null,null,null,null,null,null,null,null,null,null,null,null,null,null,null,null,null,null,null,null,null,null,null,null,null,null,"Monona",4.6519375888325375E-3,41,1.25,3]
[null,null,null,null,null,null,null,null,null,null,null,null,null,null,null,null,null,null,null,{"$error":"#DIV/0!"},{"$f":"'Input Screen'!$C$8*5280*'Input Screen'!$C$9*2*(T73-$T$6)/12*0.0575","v":{"$error":"#DIV/0!"}},{"$f":"U73/'Input Screen'!$C$8","v":{"$error":"#DIV/0!"}},{"$error":"#DIV/0!"},{"$error":"#DIV/0!"},{"$f":"U73*'Input Screen'!$C$21/1000000","v":{"$error":"#DIV/0!"}},6.7999999999999918,{"$error":"#VALUE!"},{"$error":"#VALUE!"},null,null,null,null,null,null,null,null,null,null,null,null,null,null,null,null,{"$f":"'Input Screen'!$C$8*5280*$AU$4*'Input Screen'!$C$9*2*(T73-$T$6)/12*0.0575","v":{"$error":"#DIV/0!"}},{"$error":"#DIV/0!"},{"$f":"AS73/($AU$4*'Input Screen'!$C$8)","v":{"$error":"#DIV/0!"}},{"$error":"#DIV/0!"},{"$error":"#DIV/0!"},{"$f":"AS73*'Input Screen'!$C$21/1000000","v":{"$error":"#DIV/0!"}},null,null,null,null,null,null,null,null,null,null,null,null,null,null,null,null,null,null,null,null,null,null,null,null,null,null,null,null,null,null,null,null,null,null,null,null,null,null,null,null,null,null,null,null,null,null,null,null,null,null,null,null,null,null,"Monroe",5.0590186857513838E-3,56,1.17,1]
[null,null,null,null,null,null,null,null,null,null,null,null,null,null,null,null,null,null,null,{"$error":"#DIV/0!"},{"$f":"'Input Screen'!$C$8*5280*'Input Screen'!$C$9*2*(T74-$T$6)/12*0.0575","v":{"$error":"#DIV/0!"}},{"$f":"U74/'Input Screen'!$C$8","v":{"$error":"#DIV/0!"}},{"$error":"#DIV/0!"},{"$error":"#DIV/0!"},{"$f":"U74*'Input Screen'!$C$21/1000000","v":{"$error":"#DIV/0!"}},6.8999999999999915,{"$error":"#VALUE!"},{"$error":"#VALUE!"},null,null,null,null,null,null,null,null,null,null,null,null,null,null,null,null,{"$f":"'Input Screen'!$C$8*5280*$AU$4*'Input Screen'!$C$9*2*(T74-$T$6)/12*0.0575","v":{"$error":"#DIV/0!"}},{"$error":"#DIV/0!"},{"$f":"AS74/($AU$4*'Input Screen'!$C$8)","v":{"$error":"#DIV/0!"}},{"$error":"#DIV/0!"},{"$error":"#DIV/0!"},{"$f":"AS74*'Input Screen'!$C$21/1000000","v":{"$error":"#DIV/0!"}},null,null,null,null,null,null,null,null,null,null,null,null,null,null,null,null,null,null,null,null,null,null,null,null,null,null,null,null,null,null,null,null,null,null,null,null,null,null,null,null,null,null,null,null,null,null,null,null,null,null,null,null,null,null,"Montgomery",4.4977026909159418E-3,44,1.1100000000000001,3]
[null,null,null,null,null,null,null,null,null,null,null,null,null,null,null,null,null,null,null,{"$error":"#DIV/0!"},{"$f":"'Input Screen'!$C$8*5280*'Input Screen'!$C$9*2*(T75-$T$6)/12*0.0575","v":{"$error":"#DIV/0!"}},{"$f":"U75/'Input Screen'!$C$8","v":{"$error":"#DIV/0!"}},{"$error":"#DIV/0!"},{"$error":"#DIV/0!"},{"$f":"U75*'Input Screen'!$C$21/1000000","v":{"$error":"#DIV/0!"}},6.9999999999999911,{"$error":"#VALUE!"},{"$error":"#VALUE!"},null,null,null,null,null,null,null,null,null,null,null,null,null,null,null,null,{"$f":"'Input Screen'!$C$8*5280*$AU$4*'Input Screen'!$C$9*2*(T75-$T$6)/12*0.0575","v":{"$error":"#DIV/0!"}},{"$error":"#DIV/0!"},{"$f":"AS75/($AU$4*'Input Screen'!$C$8)","v":{"$error":"#DIV/0!"}},{"$error":"#DIV/0!"},{"$error":"#DIV/0!"},{"$f":"AS75*'Input Screen'!$C$21/1000000","v":{"$error":"#DIV/0!"}},null,null,null,null,null,null,null,null,null,null,null,null,null,null,null,null,null,null,null,null,null,null,null,null,null,null,null,null,null,null,null,null,null,null,null,null,null,null,null,null,null,null,null,null,null,null,null,null,null,null,null,null,null,null,"Muscatine",5.17285088709843E-3,68,1.35,1]
[null,null,null,null,null,null,null,null,null,null,null,null,null,null,null,null,null,null,null,{"$error":"#DIV/0!"},{"$f":"'Input Screen'!$C$8*5280*'Input Screen'!$C$9*2*(T76-$T$6)/12*0.0575","v":{"$error":"#DIV/0!"}},{"$f":"U76/'Input Screen'!$C$8","v":{"$error":"#DIV/0!"}},{"$error":"#DIV/0!"},{"$error":"#DIV/0!"},{"$f":"U76*'Input Screen'!$C$21/1000000","v":{"$error":"#DIV/0!"}},7.0999999999999908,{"$error":"#VALUE!"},{"$error":"#VALUE!"},null,null,null,null,null,null,null,null,null,null,null,null,null,null,null,null,{"$f":"'Input Screen'!$C$8*5280*$AU$4*'Input Screen'!$C$9*2*(T76-$T$6)/12*0.0575","v":{"$error":"#DIV/0!"}},{"$error":"#DIV/0!"},{"$f":"AS76/($AU$4*'Input Screen'!$C$8)","v":{"$error":"#DIV/0!"}},{"$error":"#DIV/0!"},{"$error":"#DIV/0!"},{"$f":"AS76*'Input Screen'!$C$21/1000000","v":{"$error":"#DIV/0!"}},null,null,null,null,null,null,null,null,null,null,null,null,null,null,null,null,null,null,null,null,null,null,null,null,null,null,null,null,null,null,null,null,null,null,null,null,null,null,null,null,null,null,null,null,null,null,null,null,null,null,null,null,null,null,"Obrien",4.4779237627564951E-3,37,1.51,4]
[null,null,null,null,null,null,null,null,null,null,null,null,null,null,null,null,null,null,null,{"$error":"#DIV/0!"},{"$f":"'Input Screen'!$C$8*5280*'Input Screen'!$C$9*2*(T77-$T$6)/12*0.0575","v":{"$error":"#DIV/0!"}},{"$f":"U77/'Input Screen'!$C$8","v":{"$error":"#DIV/0!"}},{"$error":"#DIV/0!"},{"$error":"#DIV/0!"},{"$f":"U77*'Input Screen'!$C$21/1000000","v":{"$error":"#DIV/0!"}},7.1999999999999904,{"$error":"#VALUE!"},{"$error":"#VALUE!"},null,null,null,null,null,null,null,null,null,null,null,null,null,null,null,null,{"$f":"'Input Screen'!$C$8*5280*$AU$4*'Input Screen'!$C$9*2*(T77-$T$6)/12*0.0575","v":{"$error":"#DIV/0!"}},{"$error":"#DIV/0!"},{"$f":"AS77/($AU$4*'Input Screen'!$C$8)","v":{"$error":"#DIV/0!"}},{"$error":"#DIV/0!"},{"$error":"#DIV/0!"},{"$f":"AS77*'Input Screen'!$C$21/1000000","v":{"$error":"#DIV/0!"}},null,null,null,null,null,null,null,null,null,null,null,null,null,null,null,null,null,null,null,null,null,null,null,null,null,null,null,null,null,null,null,null,null,null,null,null,null,null,null,null,null,null,null,null,null,null,null,null,null,null,null,null,null,null,"Osceola",4.4846864942182972E-3,34,1.88,4]
[null,null,null,null,null,null,null,null,null,null,null,null,null,null,null,null,null,null,null,{"$error":"#DIV/0!"},{"$f":"'Input Screen'!$C$8*5280*'Input Screen'!$C$9*2*(T78-$T$6)/12*0.0575","v":{"$error":"#DIV/0!"}},{"$f":"U78/'Input Screen'!$C$8","v":{"$error":"#DIV/0!"}},{"$error":"#DIV/0!"},{"$error":"#DIV/0!"},{"$f":"U78*'Input Screen'!$C$21/1000000","v":{"$error":"#DIV/0!"}},7.2999999999999901,{"$error":"#VALUE!"},{"$error":"#VALUE!"},null,null,null,null,null,null,null,null,null,null,null,null,null,null,null,null,{"$f":"'Input Screen'!$C$8*5280*$AU$4*'Input Screen'!$C$9*2*(T78-$T$6)/12*0.0575","v":{"$error":"#DIV/0!"}},{"$error":"#DIV/0!"},{"$f":"AS78/($AU$4*'Input Screen'!$C$8)","v":{"$error":"#DIV/0!"}},{"$error":"#DIV/0!"},{"$error":"#DIV/0!"},{"$f":"AS78*'Input Screen'!$C$21/1000000","v":{"$error":"#DIV/0!"}},null,null,null,null,null,null,null,null,null,null,null,null,null,null,null,null,null,null,null,null,null,null,null,null,null,null,null,null,null,null,null,null,null,null,null,null,null,null,null,null,null,null,null,null,null,null,null,null,null,null,null,null,null,null,"Page",4.7735128353237136E-3,37,1.05,2]
[null,null,null,null,null,null,null,null,null,null,null,null,null,null,null,null,null,null,null,{"$error":"#DIV/0!"},{"$f":"'Input Screen'!$C$8*5280*'Input Screen'!$C$9*2*(T79-$T$6)/12*0.0575","v":{"$error":"#DIV/0!"}},{"$f":"U79/'Input Screen'!$C$8","v":{"$error":"#DIV/0!"}},{"$error":"#DIV/0!"},{"$error":"#DIV/0!"},{"$f":"U79*'Input Screen'!$C$21/1000000","v":{"$error":"#DIV/0!"}},7.3999999999999897,{"$error":"#VALUE!"},{"$error":"#VALUE!"},null,null,null,null,null,null,null,null,null,null,null,null,null,null,null,null,{"$f":"'Input Screen'!$C$8*5280*$AU$4*'Input Screen'!$C$9*2*(T79-$T$6)/12*0.0575","v":{"$error":"#DIV/0!"}},{"$error":"#DIV/0!"},{"$f":"AS79/($AU$4*'Input Screen'!$C$8)","v":{"$error":"#DIV/0!"}},{"$error":"#DIV/0!"},{"$error":"#DIV/0!"},{"$f":"AS79*'Input Screen'!$C$21/1000000","v":{"$error":"#DIV/0!"}},null,null,null,null,null,null,null,null,null,null,null,null,null,null,null,null,null,null,null,null,null,null,null,null,null,null,null,null,null,null,null,null,null,null,null,null,null,null,null,null,null,null,null,null,null,null,null,null,null,null,null,null,null,null,"Palo alto",4.6007517133898413E-3,39,1.63,4]
[null,null,null,null,null,null,null,null,null,null,null,null,null,null,null,null,null,null,null,{"$error":"#DIV/0!"},{"$f":"'Input Screen'!$C$8*5280*'Input Screen'!$C$9*2*(T80-$T$6)/12*0.0575","v":{"$error":"#DIV/0!"}},{"$f":"U80/'Input Screen'!$C$8","v":{"$error":"#DIV/0!"}},{"$error":"#DIV/0!"},{"$error":"#DIV/0!"},{"$f":"U80*'Input Screen'!$C$21/1000000","v":{"$error":"#DIV/0!"}},7.4999999999999893,{"$error":"#VALUE!"},{"$error":"#VALUE!"},null,null,null,null,null,null,null,null,null,null,null,null,null,null,null,null,{"$f":"'Input Screen'!$C$8*5280*$AU$4*'Input Screen'!$C$9*2*(T80-$T$6)/12*0.0575","v":{"$error":"#DIV/0!"}},{"$error":"#DIV/0!"},{"$f":"AS80/($AU$4*'Input Screen'!$C$8)","v":{"$error":"#DIV/0!"}},{"$error":"#DIV/0!"},{"$error":"#DIV/0!"},{"$f":"AS80*'Input Screen'!$C$21/1000000","v":{"$error":"#DIV/0!"}},null,null,null,null,null,null,null,null,null,null,null,null,null,null,null,null,null,null,null,null,null,null,null,null,null,null,null,null,null,null,null,null,null,null,null,null,null,null,null,null,null,null,null,null,null,null,null,null,null,null,null,null,null,null,"Plymouth",4.249801403450556E-3,50,1.62,4]
[null,null,null,null,null,null,null,null,null,null,null,null,null,null,null,null,null,null,null,{"$error":"#DIV/0!"},{"$f":"'Input Screen'!$C$8*5280*'Input Screen'!$C$9*2*(T81-$T$6)/12*0.0575","v":{"$error":"#DIV/0!"}},{"$f":"U81/'Input Screen'!$C$8","v":{"$error":"#DIV/0!"}},{"$error":"#DIV/0!"},{"$error":"#DIV/0!"},{"$f":"U81*'Input Screen'!$C$21/1000000","v":{"$error":"#DIV/0!"}},7.599999999999989,{"$error":"#VALUE!"},{"$error":"#VALUE!"},null,null,null,null,null,null,null,null,null,null,null,null,null,null,null,null,{"$f":"'Input Screen'!$C$8*5280*$AU$4*'Input Screen'!$C$9*2*(T81-$T$6)/12*0.0575","v":{"$error":"#DIV/0!"}},{"$error":"#DIV/0!"},{"$f":"AS81/($AU$4*'Input Screen'!$C$8)","v":{"$error":"#DIV/0!"}},{"$error":"#DIV/0!"},{"$error":"#DIV/0!"},{"$f":"AS81*'Input Screen'!$C$21/1000000","v":{"$error":"#DIV/0!"}},null,null,null,null,null,null,null,null,null,null,null,null,null,null,null,null,null,null,null,null,null,null,null,null,null,null,null,null,null,null,null,null,null,null,null,null,null,null,null,null,null,null,null,null,null,null,null,null,null,null,null,null,null,null,"Pocahontas",4.6007517133898413E-3,30,1.97,4]
[null,null,null,null,null,null,null,null,null,null,null,null,null,null,null,null,null,null,null,{"$error":"#DIV/0!"},{"$f":"'Input Screen'!$C$8*5280*'Input Screen'!$C$9*2*(T82-$T$6)/12*0.0575","v":{"$error":"#DIV/0!"}},{"$f":"U82/'Input Screen'!$C$8","v":{"$error":"#DIV/0!"}},{"$error":"#DIV/0!"},{"$error":"#DIV/0!"},{"$f":"U82*'Input Screen'!$C$21/1000000","v":{"$error":"#DIV/0!"}},7.6999999999999886,{"$error":"#VALUE!"},{"$error":"#VALUE!"},null,null,null,null,null,null,null,null,null,null,null,null,null,null,null,null,{"$f":"'Input Screen'!$C$8*5280*$AU$4*'Input Screen'!$C$9*2*(T82-$T$6)/12*0.0575","v":{"$error":"#DIV/0!"}},{"$error":"#DIV/0!"},{"$f":"AS82/($AU$4*'Input Screen'!$C$8)","v":{"$error":"#DIV/0!"}},{"$error":"#DIV/0!"},{"$error":"#DIV/0!"},{"$f":"AS82*'Input Screen'!$C$21/1000000","v":{"$error":"#DIV/0!"}},null,null,null,null,null,null,null,null,null,null,null,null,null,null,null,null,null,null,null,null,null,null,null,null,null,null,null,null,null,null,null,null,null,null,null,null,null,null,null,null,null,null,null,null,null,null,null,null,null,null,null,null,null,null,"Polk",5.2099702299933E-3,1139,1.81,3]
[null,null,null,null,null,null,null,null,null,null,null,null,null,null,null,null,null,null,null,{"$error":"#DIV/0!"},{"$f":"'Input Screen'!$C$8*5280*'Input Screen'!$C$9*2*(T83-$T$6)/12*0.0575","v":{"$error":"#DIV/0!"}},{"$f":"U83/'Input Screen'!$C$8","v":{"$error":"#DIV/0!"}},{"$error":"#DIV/0!"},{"$error":"#DIV/0!"},{"$f":"U83*'Input Screen'!$C$21/1000000","v":{"$error":"#DIV/0!"}},7.7999999999999883,{"$error":"#VALUE!"},{"$error":"#VALUE!"},null,null,null,null,null,null,null,null,null,null,null,null,null,null,null,null,{"$f":"'Input Screen'!$C$8*5280*$AU$4*'Input Screen'!$C$9*2*(T83-$T$6)/12*0.0575","v":{"$error":"#DIV/0!"}},{"$error":"#DIV/0!"},{"$f":"AS83/($AU$4*'Input Screen'!$C$8)","v":{"$error":"#DIV/0!"}},{"$error":"#DIV/0!"},{"$error":"#DIV/0!"},{"$f":"AS83*'Input Screen'!$C$21/1000000","v":{"$error":"#DIV/0!"}},null,null,null,null,null,null,null,null,null,null,null,null,null,null,null,null,null,null,null,null,null,null,null,null,null,null,null,null,null,null,null,null,null,null,null,null,null,null,null,null,null,null,null,null,null,null,null,null,null,null,null,null,null,null,"Pottawattamie",4.4977026909159418E-3,67,1.26,3]
[null,null,null,null,null,null,null,null,null,null,null,null,null,null,null,null,null,null,null,{"$error":"#DIV/0!"},{"$f":"'Input Screen'!$C$8*5280*'Input Screen'!$C$9*2*(T84-$T$6)/12*0.0575","v":{"$error":"#DIV/0!"}},{"$f":"U84/'Input Screen'!$C$8","v":{"$error":"#DIV/0!"}},{"$error":"#DIV/0!"},{"$error":"#DIV/0!"},{"$f":"U84*'Input Screen'!$C$21/1000000","v":{"$error":"#DIV/0!"}},7.8999999999999879,{"$error":"#VALUE!"},{"$error":"#VALUE!"},null,null,null,null,null,null,null,null,null,null,null,null,null,null,null,null,{"$f":"'Input Screen'!$C$8*5280*$AU$4*'Input Screen'!$C$9*2*(T84-$T$6)/12*0.0575","v":{"$error":"#DIV/0!"}},{"$error":"#DIV/0!"},{"$f":"AS84/($AU$4*'Input Screen'!$C$8)","v":{"$error":"#DIV/0!"}},{"$error":"#DIV/0!"},{"$error":"#DIV/0!"},{"$f":"AS84*'Input Screen'!$C$21/1000000","v":{"$error":"#DIV/0!"}},null,null,null,null,null,null,null,null,null,null,null,null,null,null,null,null,null,null,null,null,null,null,null,null,null,null,null,null,null,null,null,null,null,null,null,null,null,null,null,null,null,null,null,null,null,null,null,null,null,null,null,null,null,null,"Poweshiek",5.1485074747975599E-3,44,1.22,2]
[null,null,null,null,null,null,null,null,null,null,null,null,null,null,null,null,null,null,null,{"$error":"#DIV/0!"},{"$f":"'Input Screen'!$C$8*5280*'Input Screen'!$C$9*2*(T85-$T$6)/12*0.0575","v":{"$error":"#DIV/0!"}},{"$f":"U85/'Input Screen'!$C$8","v":{"$error":"#DIV/0!"}},{"$error":"#DIV/0!"},{"$error":"#DIV/0!"},{"$f":"U85*'Input Screen'!$C$21/1000000","v":{"$error":"#DIV/0!"}},7.9999999999999876,{"$error":"#VALUE!"},{"$error":"#VALUE!"},null,null,null,null,null,null,null,null,null,null,null,null,null,null,null,null,{"$f":"'Input Screen'!$C$8*5280*$AU$4*'Input Screen'!$C$9*2*(T85-$T$6)/12*0.0575","v":{"$error":"#DIV/0!"}},{"$error":"#DIV/0!"},{"$f":"AS85/($AU$4*'Input Screen'!$C$8)","v":{"$error":"#DIV/0!"}},{"$error":"#DIV/0!"},{"$error":"#DIV/0!"},{"$f":"AS85*'Input Screen'!$C$21/1000000","v":{"$error":"#DIV/0!"}},null,null,null,null,null,null,null,null,null,null,null,null,null,null,null,null,null,null,null,null,null,null,null,null,null,null,null,null,null,null,null,null,null,null,null,null,null,null,null,null,null,null,null,null,null,null,null,null,null,null,null,null,null,null,"Ringgold",5.1181664959727988E-3,41,1.24,2]
[null,null,null,null,null,null,null,null,null,null,null,null,null,null,null,null,null,null,null,{"$error":"#DIV/0!"},{"$f":"'Input Screen'!$C$8*5280*'Input Screen'!$C$9*2*(T86-$T$6)/12*0.0575","v":{"$error":"#DIV/0!"}},{"$f":"U86/'Input Screen'!$C$8","v":{"$error":"#DIV/0!"}},{"$error":"#DIV/0!"},{"$error":"#DIV/0!"},{"$f":"U86*'Input Screen'!$C$21/1000000","v":{"$error":"#DIV/0!"}},8.0999999999999872,{"$error":"#VALUE!"},{"$error":"#VALUE!"},null,null,null,null,null,null,null,null,null,null,null,null,null,null,null,null,{"$f":"'Input Screen'!$C$8*5280*$AU$4*'Input Screen'!$C$9*2*(T86-$T$6)/12*0.0575","v":{"$error":"#DIV/0!"}},{"$error":"#DIV/0!"},{"$f":"AS86/($AU$4*'Input Screen'!$C$8)","v":{"$error":"#DIV/0!"}},{"$error":"#DIV/0!"},{"$error":"#DIV/0!"},{"$f":"AS86*'Input Screen'!$C$21/1000000","v":{"$error":"#DIV/0!"}},null,null,null,null,null,null,null,null,null,null,null,null,null,null,null,null,null,null,null,null,null,null,null,null,null,null,null,null,null,null,null,null,null,null,null,null,null,null,null,null,null,null,null,null,null,null,null,null,null,null,null,null,null,null,"Sac",4.6150855924426979E-3,35,1.38,3]
[null,null,null,null,null,null,null,null,null,null,null,null,null,null,null,null,null,null,null,{"$error":"#DIV/0!"},{"$f":"'Input Screen'!$C$8*5280*'Input Screen'!$C$9*2*(T87-$T$6)/12*0.0575","v":{"$error":"#DIV/0!"}},{"$f":"U87/'Input Screen'!$C$8","v":{"$error":"#DIV/0!"}},{"$error":"#DIV/0!"},{"$error":"#DIV/0!"},{"$f":"U87*'Input Screen'!$C$21/1000000","v":{"$error":"#DIV/0!"}},8.1999999999999869,{"$error":"#VALUE!"},{"$error":"#VALUE!"},null,null,null,null,null,null,null,null,null,null,null,null,null,null,null,null,{"$f":"'Input Screen'!$C$8*5280*$AU$4*'Input Screen'!$C$9*2*(T87-$T$6)/12*0.0575","v":{"$error":"#DIV/0!"}},{"$error":"#DIV/0!"},{"$f":"AS87/($AU$4*'Input Screen'!$C$8)","v":{"$error":"#DIV/0!"}},{"$error":"#DIV/0!"},{"$error":"#DIV/0!"},{"$f":"AS87*'Input Screen'!$C$21/1000000","v":{"$error":"#DIV/0!"}},null,null,null,null,null,null,null,null,null,null,null,null,null,null,null,null,null,null,null,null,null,null,null,null,null,null,null,null,null,null,null,null,null,null,null,null,null,null,null,null,null,null,null,null,null,null,null,null,null,null,null,null,null,null,"Scott",5.2705803863944767E-3,132,1.74,1]
[null,null,null,null,null,null,null,null,null,null,null,null,null,null,null,null,null,null,null,{"$error":"#DIV/0!"},{"$f":"'Input Screen'!$C$8*5280*'Input Screen'!$C$9*2*(T88-$T$6)/12*0.0575","v":{"$error":"#DIV/0!"}},{"$f":"U88/'Input Screen'!$C$8","v":{"$error":"#DIV/0!"}},{"$error":"#DIV/0!"},{"$error":"#DIV/0!"},{"$f":"U88*'Input Screen'!$C$21/1000000","v":{"$error":"#DIV/0!"}},8.2999999999999865,{"$error":"#VALUE!"},{"$error":"#VALUE!"},null,null,null,null,null,null,null,null,null,null,null,null,null,null,null,null,{"$f":"'Input Screen'!$C$8*5280*$AU$4*'Input Screen'!$C$9*2*(T88-$T$6)/12*0.0575","v":{"$error":"#DIV/0!"}},{"$error":"#DIV/0!"},{"$f":"AS88/($AU$4*'Input Screen'!$C$8)","v":{"$error":"#DIV/0!"}},{"$error":"#DIV/0!"},{"$error":"#DIV/0!"},{"$f":"AS88*'Input Screen'!$C$21/1000000","v":{"$error":"#DIV/0!"}},null,null,null,null,null,null,null,null,null,null,null,null,null,null,null,null,null,null,null,null,null,null,null,null,null,null,null,null,null,null,null,null,null,null,null,null,null,null,null,null,null,null,null,null,null,null,null,null,null,null,null,null,null,null,"Shelby",4.7899344518700258E-3,43,1.37,3]
[null,null,null,null,null,null,null,null,null,null,null,null,null,null,null,null,null,null,null,{"$error":"#DIV/0!"},{"$f":"'Input Screen'!$C$8*5280*'Input Screen'!$C$9*2*(T89-$T$6)/12*0.0575","v":{"$error":"#DIV/0!"}},{"$f":"U89/'Input Screen'!$C$8","v":{"$error":"#DIV/0!"}},{"$error":"#DIV/0!"},{"$error":"#DIV/0!"},{"$f":"U89*'Input Screen'!$C$21/1000000","v":{"$error":"#DIV/0!"}},8.3999999999999861,{"$error":"#VALUE!"},{"$error":"#VALUE!"},null,null,null,null,null,null,null,null,null,null,null,null,null,null,null,null,{"$f":"'Input Screen'!$C$8*5280*$AU$4*'Input Screen'!$C$9*2*(T89-$T$6)/12*0.0575","v":{"$error":"#DIV/0!"}},{"$error":"#DIV/0!"},{"$f":"AS89/($AU$4*'Input Screen'!$C$8)","v":{"$error":"#DIV/0!"}},{"$error":"#DIV/0!"},{"$error":"#DIV/0!"},{"$f":"AS89*'Input Screen'!$C$21/1000000","v":{"$error":"#DIV/0!"}},null,null,null,null,null,null,null,null,null,null,null,null,null,null,null,null,null,null,null,null,null,null,null,null,null,null,null,null,null,null,null,null,null,null,null,null,null,null,null,null,null,null,null,null,null,null,null,null,null,null,null,null,null,null,"Sioux",4.249801403450556E-3,67,1.69,4]
[null,null,null,null,null,null,null,null,null,null,null,null,null,null,null,null,null,null,null,{"$error":"#DIV/0!"},{"$f":"'Input Screen'!$C$8*5280*'Input Screen'!$C$9*2*(T90-$T$6)/12*0.0575","v":{"$error":"#DIV/0!"}},{"$f":"U90/'Input Screen'!$C$8","v":{"$error":"#DIV/0!"}},{"$error":"#DIV/0!"},{"$error":"#DIV/0!"},{"$f":"U90*'Input Screen'!$C$21/1000000","v":{"$error":"#DIV/0!"}},8.4999999999999858,{"$error":"#VALUE!"},{"$error":"#VALUE!"},null,null,null,null,null,null,null,null,null,null,null,null,null,null,null,null,{"$f":"'Input Screen'!$C$8*5280*$AU$4*'Input Screen'!$C$9*2*(T90-$T$6)/12*0.0575","v":{"$error":"#DIV/0!"}},{"$error":"#DIV/0!"},{"$f":"AS90/($AU$4*'Input Screen'!$C$8)","v":{"$error":"#DIV/0!"}},{"$error":"#DIV/0!"},{"$error":"#DIV/0!"},{"$f":"AS90*'Input Screen'!$C$21/1000000","v":{"$error":"#DIV/0!"}},null,null,null,null,null,null,null,null,null,null,null,null,null,null,null,null,null,null,null,null,null,null,null,null,null,null,null,null,null,null,null,null,null,null,null,null,null,null,null,null,null,null,null,null,null,null,null,null,null,null,null,null,null,null,"Story",5.1970263051977399E-3,89,2.2000000000000002,2]
[null,null,null,null,null,null,null,null,null,null,null,null,null,null,null,null,null,null,null,{"$error":"#DIV/0!"},{"$f":"'Input Screen'!$C$8*5280*'Input Screen'!$C$9*2*(T91-$T$6)/12*0.0575","v":{"$error":"#DIV/0!"}},{"$f":"U91/'Input Screen'!$C$8","v":{"$error":"#DIV/0!"}},{"$error":"#DIV/0!"},{"$error":"#DIV/0!"},{"$f":"U91*'Input Screen'!$C$21/1000000","v":{"$error":"#DIV/0!"}},8.5999999999999854,{"$error":"#VALUE!"},{"$error":"#VALUE!"},null,null,null,null,null,null,null,null,null,null,null,null,null,null,null,null,{"$f":"'Input Screen'!$C$8*5280*$AU$4*'Input Screen'!$C$9*2*(T91-$T$6)/12*0.0575","v":{"$error":"#DIV/0!"}},{"$error":"#DIV/0!"},{"$f":"AS91/($AU$4*'Input Screen'!$C$8)","v":{"$error":"#DIV/0!"}},{"$error":"#DIV/0!"},{"$error":"#DIV/0!"},{"$f":"AS91*'Input Screen'!$C$21/1000000","v":{"$error":"#DIV/0!"}},null,null,null,null,null,null,null,null,null,null,null,null,null,null,null,null,null,null,null,null,null,null,null,null,null,null,null,null,null,null,null,null,null,null,null,null,null,null,null,null,null,null,null,null,null,null,null,null,null,null,null,null,null,null,"Tama",5.0062591678539606E-3,52,1.51,2]
[null,null,null,null,null,null,null,null,null,null,null,null,null,null,null,null,null,null,null,{"$error":"#DIV/0!"},{"$f":"'Input Screen'!$C$8*5280*'Input Screen'!$C$9*2*(T92-$T$6)/12*0.0575","v":{"$error":"#DIV/0!"}},{"$f":"U92/'Input Screen'!$C$8","v":{"$error":"#DIV/0!"}},{"$error":"#DIV/0!"},{"$error":"#DIV/0!"},{"$f":"U92*'Input Screen'!$C$21/1000000","v":{"$error":"#DIV/0!"}},8.6999999999999851,{"$error":"#VALUE!"},{"$error":"#VALUE!"},null,null,null,null,null,null,null,null,null,null,null,null,null,null,null,null,{"$f":"'Input Screen'!$C$8*5280*$AU$4*'Input Screen'!$C$9*2*(T92-$T$6)/12*0.0575","v":{"$error":"#DIV/0!"}},{"$error":"#DIV/0!"},{"$f":"AS92/($AU$4*'Input Screen'!$C$8)","v":{"$error":"#DIV/0!"}},{"$error":"#DIV/0!"},{"$error":"#DIV/0!"},{"$f":"AS92*'Input Screen'!$C$21/1000000","v":{"$error":"#DIV/0!"}},null,null,null,null,null,null,null,null,null,null,null,null,null,null,null,null,null,null,null,null,null,null,null,null,null,null,null,null,null,null,null,null,null,null,null,null,null,null,null,null,null,null,null,null,null,null,null,null,null,null,null,null,null,null,"Taylor",5.1181664959727988E-3,36,1.03,2]
[null,null,null,null,null,null,null,null,null,null,null,null,null,null,null,null,null,null,null,{"$error":"#DIV/0!"},{"$f":"'Input Screen'!$C$8*5280*'Input Screen'!$C$9*2*(T93-$T$6)/12*0.0575","v":{"$error":"#DIV/0!"}},{"$f":"U93/'Input Screen'!$C$8","v":{"$error":"#DIV/0!"}},{"$error":"#DIV/0!"},{"$error":"#DIV/0!"},{"$f":"U93*'Input Screen'!$C$21/1000000","v":{"$error":"#DIV/0!"}},8.7999999999999847,{"$error":"#VALUE!"},{"$error":"#VALUE!"},null,null,null,null,null,null,null,null,null,null,null,null,null,null,null,null,{"$f":"'Input Screen'!$C$8*5280*$AU$4*'Input Screen'!$C$9*2*(T93-$T$6)/12*0.0575","v":{"$error":"#DIV/0!"}},{"$error":"#DIV/0!"},{"$f":"AS93/($AU$4*'Input Screen'!$C$8)","v":{"$error":"#DIV/0!"}},{"$error":"#DIV/0!"},{"$error":"#DIV/0!"},{"$f":"AS93*'Input Screen'!$C$21/1000000","v":{"$error":"#DIV/0!"}},null,null,null,null,null,null,null,null,null,null,null,null,null,null,null,null,null,null,null,null,null,null,null,null,null,null,null,null,null,null,null,null,null,null,null,null,null,null,null,null,null,null,null,null,null,null,null,null,null,null,null,null,null,null,"Union",5.1431685192561303E-3,51,1.0900000000000001,1]
[null,null,null,null,null,null,null,null,null,null,null,null,null,null,null,null,null,null,null,{"$error":"#DIV/0!"},{"$f":"'Input Screen'!$C$8*5280*'Input Screen'!$C$9*2*(T94-$T$6)/12*0.0575","v":{"$error":"#DIV/0!"}},{"$f":"U94/'Input Screen'!$C$8","v":{"$error":"#DIV/0!"}},{"$error":"#DIV/0!"},{"$error":"#DIV/0!"},{"$f":"U94*'Input Screen'!$C$21/1000000","v":{"$error":"#DIV/0!"}},8.8999999999999844,{"$error":"#VALUE!"},{"$error":"#VALUE!"},null,null,null,null,null,null,null,null,null,null,null,null,null,null,null,null,{"$f":"'Input Screen'!$C$8*5280*$AU$4*'Input Screen'!$C$9*2*(T94-$T$6)/12*0.0575","v":{"$error":"#DIV/0!"}},{"$error":"#DIV/0!"},{"$f":"AS94/($AU$4*'Input Screen'!$C$8)","v":{"$error":"#DIV/0!"}},{"$error":"#DIV/0!"},{"$error":"#DIV/0!"},{"$f":"AS94*'Input Screen'!$C$21/1000000","v":{"$error":"#DIV/0!"}},null,null,null,null,null,null,null,null,null,null,null,null,null,null,null,null,null,null,null,null,null,null,null,null,null,null,null,null,null,null,null,null,null,null,null,null,null,null,null,null,null,null,null,null,null,null,null,null,null,null,null,null,null,null,"Van Buren",5.3844987675618593E-3,45,1.35,1]
[null,null,null,null,null,null,null,null,null,null,null,null,null,null,null,null,null,null,null,{"$error":"#DIV/0!"},{"$f":"'Input Screen'!$C$8*5280*'Input Screen'!$C$9*2*(T95-$T$6)/12*0.0575","v":{"$error":"#DIV/0!"}},{"$f":"U95/'Input Screen'!$C$8","v":{"$error":"#DIV/0!"}},{"$error":"#DIV/0!"},{"$error":"#DIV/0!"},{"$f":"U95*'Input Screen'!$C$21/1000000","v":{"$error":"#DIV/0!"}},8.999999999999984,{"$error":"#VALUE!"},{"$error":"#VALUE!"},null,null,null,null,null,null,null,null,null,null,null,null,null,null,null,null,{"$f":"'Input Screen'!$C$8*5280*$AU$4*'Input Screen'!$C$9*2*(T95-$T$6)/12*0.0575","v":{"$error":"#DIV/0!"}},{"$error":"#DIV/0!"},{"$f":"AS95/($AU$4*'Input Screen'!$C$8)","v":{"$error":"#DIV/0!"}},{"$error":"#DIV/0!"},{"$error":"#DIV/0!"},{"$f":"AS95*'Input Screen'!$C$21/1000000","v":{"$error":"#DIV/0!"}},null,null,null,null,null,null,null,null,null,null,null,null,null,null,null,null,null,null,null,null,null,null,null,null,null,null,null,null,null,null,null,null,null,null,null,null,null,null,null,null,null,null,null,null,null,null,null,null,null,null,null,null,null,null,"Wapello",5.0611603539117544E-3,78,1.2,1]
[null,null,null,null,null,null,null,null,null,null,null,null,null,null,null,null,null,null,null,{"$error":"#DIV/0!"},{"$f":"'Input Screen'!$C$8*5280*'Input Screen'!$C$9*2*(T96-$T$6)/12*0.0575","v":{"$error":"#DIV/0!"}},{"$f":"U96/'Input Screen'!$C$8","v":{"$error":"#DIV/0!"}},{"$error":"#DIV/0!"},{"$error":"#DIV/0!"},{"$f":"U96*'Input Screen'!$C$21/1000000","v":{"$error":"#DIV/0!"}},9.0999999999999837,{"$error":"#VALUE!"},{"$error":"#VALUE!"},null,null,null,null,null,null,null,null,null,null,null,null,null,null,null,null,{"$f":"'Input Screen'!$C$8*5280*$AU$4*'Input Screen'!$C$9*2*(T96-$T$6)/12*0.0575","v":{"$error":"#DIV/0!"}},{"$error":"#DIV/0!"},{"$f":"AS96/($AU$4*'Input Screen'!$C$8)","v":{"$error":"#DIV/0!"}},{"$error":"#DIV/0!"},{"$error":"#DIV/0!"},{"$f":"AS96*'Input Screen'!$C$21/1000000","v":{"$error":"#DIV/0!"}},null,null,null,null,null,null,null,null,null,null,null,null,null,null,null,null,null,null,null,null,null,null,null,null,null,null,null,null,null,null,null,null,null,null,null,null,null,null,null,null,null,null,null,null,null,null,null,null,null,null,null,null,null,null,"Warren",5.2099702299932956E-3,110,1.08,1]
[null,null,null,null,null,null,null,null,null,null,null,null,null,null,null,null,null,null,null,{"$error":"#DIV/0!"},{"$f":"'Input Screen'!$C$8*5280*'Input Screen'!$C$9*2*(T97-$T$6)/12*0.0575","v":{"$error":"#DIV/0!"}},{"$f":"U97/'Input Screen'!$C$8","v":{"$error":"#DIV/0!"}},{"$error":"#DIV/0!"},{"$error":"#DIV/0!"},{"$f":"U97*'Input Screen'!$C$21/1000000","v":{"$error":"#DIV/0!"}},9.1999999999999833,{"$error":"#VALUE!"},{"$error":"#VALUE!"},null,null,null,null,null,null,null,null,null,null,null,null,null,null,null,null,{"$f":"'Input Screen'!$C$8*5280*$AU$4*'Input Screen'!$C$9*2*(T97-$T$6)/12*0.0575","v":{"$error":"#DIV/0!"}},{"$error":"#DIV/0!"},{"$f":"AS97/($AU$4*'Input Screen'!$C$8)","v":{"$error":"#DIV/0!"}},{"$error":"#DIV/0!"},{"$error":"#DIV/0!"},{"$f":"AS97*'Input Screen'!$C$21/1000000","v":{"$error":"#DIV/0!"}},null,null,null,null,null,null,null,null,null,null,null,null,null,null,null,null,null,null,null,null,null,null,null,null,null,null,null,null,null,null,null,null,null,null,null,null,null,null,null,null,null,null,null,null,null,null,null,null,null,null,null,null,null,null,"Washington",5.1274035463285796E-3,59,1.41,2]
[null,null,null,null,null,null,null,null,null,null,null,null,null,null,null,null,null,null,null,{"$error":"#DIV/0!"},{"$f":"'Input Screen'!$C$8*5280*'Input Screen'!$C$9*2*(T98-$T$6)/12*0.0575","v":{"$error":"#DIV/0!"}},{"$f":"U98/'Input Screen'!$C$8","v":{"$error":"#DIV/0!"}},{"$error":"#DIV/0!"},{"$error":"#DIV/0!"},{"$f":"U98*'Input Screen'!$C$21/1000000","v":{"$error":"#DIV/0!"}},9.2999999999999829,{"$error":"#VALUE!"},{"$error":"#VALUE!"},null,null,null,null,null,null,null,null,null,null,null,null,null,null,null,null,{"$f":"'Input Screen'!$C$8*5280*$AU$4*'Input Screen'!$C$9*2*(T98-$T$6)/12*0.0575","v":{"$error":"#DIV/0!"}},{"$error":"#DIV/0!"},{"$f":"AS98/($AU$4*'Input Screen'!$C$8)","v":{"$error":"#DIV/0!"}},{"$error":"#DIV/0!"},{"$error":"#DIV/0!"},{"$f":"AS98*'Input Screen'!$C$21/1000000","v":{"$error":"#DIV/0!"}},null,null,null,null,null,null,null,null,null,null,null,null,null,null,null,null,null,null,null,null,null,null,null,null,null,null,null,null,null,null,null,null,null,null,null,null,null,null,null,null,null,null,null,null,null,null,null,null,null,null,null,null,null,null,"Wayne",5.3344695167726599E-3,38,1.36,2]
[null,null,null,null,null,null,null,null,null,null,null,null,null,null,null,null,null,null,null,{"$error":"#DIV/0!"},{"$f":"'Input Screen'!$C$8*5280*'Input Screen'!$C$9*2*(T99-$T$6)/12*0.0575","v":{"$error":"#DIV/0!"}},{"$f":"U99/'Input Screen'!$C$8","v":{"$error":"#DIV/0!"}},{"$error":"#DIV/0!"},{"$error":"#DIV/0!"},{"$f":"U99*'Input Screen'!$C$21/1000000","v":{"$error":"#DIV/0!"}},9.3999999999999826,{"$error":"#VALUE!"},{"$error":"#VALUE!"},null,null,null,null,null,null,null,null,null,null,null,null,null,null,null,null,{"$f":"'Input Screen'!$C$8*5280*$AU$4*'Input Screen'!$C$9*2*(T99-$T$6)/12*0.0575","v":{"$error":"#DIV/0!"}},{"$error":"#DIV/0!"},{"$f":"AS99/($AU$4*'Input Screen'!$C$8)","v":{"$error":"#DIV/0!"}},{"$error":"#DIV/0!"},{"$error":"#DIV/0!"},{"$f":"AS99*'Input Screen'!$C$21/1000000","v":{"$error":"#DIV/0!"}},null,null,null,null,null,null,null,null,null,null,null,null,null,null,null,null,null,null,null,null,null,null,null,null,null,null,null,null,null,null,null,null,null,null,null,null,null,null,null,null,null,null,null,null,null,null,null,null,null,null,null,null,null,null,"Webster",4.7018705159525605E-3,44,1.65,4]
[null,null,null,null,null,null,null,null,null,null,null,null,null,null,null,null,null,null,null,{"$error":"#DIV/0!"},{"$f":"'Input Screen'!$C$8*5280*'Input Screen'!$C$9*2*(T100-$T$6)/12*0.0575","v":{"$error":"#DIV/0!"}},{"$f":"U100/'Input Screen'!$C$8","v":{"$error":"#DIV/0!"}},{"$error":"#DIV/0!"},{"$error":"#DIV/0!"},{"$f":"U100*'Input Screen'!$C$21/1000000","v":{"$error":"#DIV/0!"}},9.4999999999999822,{"$error":"#VALUE!"},{"$error":"#VALUE!"},null,null,null,null,null,null,null,null,null,null,null,null,null,null,null,null,{"$f":"'Input Screen'!$C$8*5280*$AU$4*'Input Screen'!$C$9*2*(T100-$T$6)/12*0.0575","v":{"$error":"#DIV/0!"}},{"$error":"#DIV/0!"},{"$f":"AS100/($AU$4*'Input Screen'!$C$8)","v":{"$error":"#DIV/0!"}},{"$error":"#DIV/0!"},{"$error":"#DIV/0!"},{"$f":"AS100*'Input Screen'!$C$21/1000000","v":{"$error":"#DIV/0!"}},null,null,null,null,null,null,null,null,null,null,null,null,null,null,null,null,null,null,null,null,null,null,null,null,null,null,null,null,null,null,null,null,null,null,null,null,null,null,null,null,null,null,null,null,null,null,null,null,null,null,null,null,null,null,"Winnebago",4.9729635429116197E-3,38,1.96,4]
[null,null,null,null,null,null,null,null,null,null,null,null,null,null,null,null,null,null,null,{"$error":"#DIV/0!"},{"$f":"'Input Screen'!$C$8*5280*'Input Screen'!$C$9*2*(T101-$T$6)/12*0.0575","v":{"$error":"#DIV/0!"}},{"$f":"U101/'Input Screen'!$C$8","v":{"$error":"#DIV/0!"}},{"$error":"#DIV/0!"},{"$error":"#DIV/0!"},{"$f":"U101*'Input Screen'!$C$21/1000000","v":{"$error":"#DIV/0!"}},9.5999999999999819,{"$error":"#VALUE!"},{"$error":"#VALUE!"},null,null,null,null,null,null,null,null,null,null,null,null,null,null,null,null,{"$f":"'Input Screen'!$C$8*5280*$AU$4*'Input Screen'!$C$9*2*(T101-$T$6)/12*0.0575","v":{"$error":"#DIV/0!"}},{"$error":"#DIV/0!"},{"$f":"AS101/($AU$4*'Input Screen'!$C$8)","v":{"$error":"#DIV/0!"}},{"$error":"#DIV/0!"},{"$error":"#DIV/0!"},{"$f":"AS101*'Input Screen'!$C$21/1000000","v":{"$error":"#DIV/0!"}},null,null,null,null,null,null,null,null,null,null,null,null,null,null,null,null,null,null,null,null,null,null,null,null,null,null,null,null,null,null,null,null,null,null,null,null,null,null,null,null,null,null,null,null,null,null,null,null,null,null,null,null,null,null,"Winneshiek",5.1512198700166953E-3,68,1.47,1]
[null,null,null,null,null,null,null,null,null,null,null,null,null,null,null,null,null,null,null,{"$error":"#DIV/0!"},{"$f":"'Input Screen'!$C$8*5280*'Input Screen'!$C$9*2*(T102-$T$6)/12*0.0575","v":{"$error":"#DIV/0!"}},{"$f":"U102/'Input Screen'!$C$8","v":{"$error":"#DIV/0!"}},{"$error":"#DIV/0!"},{"$error":"#DIV/0!"},{"$f":"U102*'Input Screen'!$C$21/1000000","v":{"$error":"#DIV/0!"}},9.6999999999999815,{"$error":"#VALUE!"},{"$error":"#VALUE!"},null,null,null,null,null,null,null,null,null,null,null,null,null,null,null,null,{"$f":"'Input Screen'!$C$8*5280*$AU$4*'Input Screen'!$C$9*2*(T102-$T$6)/12*0.0575","v":{"$error":"#DIV/0!"}},{"$error":"#DIV/0!"},{"$f":"AS102/($AU$4*'Input Screen'!$C$8)","v":{"$error":"#DIV/0!"}},{"$error":"#DIV/0!"},{"$error":"#DIV/0!"},{"$f":"AS102*'Input Screen'!$C$21/1000000","v":{"$error":"#DIV/0!"}},null,null,null,null,null,null,null,null,null,null,null,null,null,null,null,null,null,null,null,null,null,null,null,null,null,null,null,null,null,null,null,null,null,null,null,null,null,null,null,null,null,null,null,null,null,null,null,null,null,null,null,null,null,null,"Woodbury",4.2699138882310072E-3,72,1.99,4]
[null,null,null,null,null,null,null,null,null,null,null,null,null,null,null,null,null,null,null,{"$error":"#DIV/0!"},{"$f":"'Input Screen'!$C$8*5280*'Input Screen'!$C$9*2*(T103-$T$6)/12*0.0575","v":{"$error":"#DIV/0!"}},{"$f":"U103/'Input Screen'!$C$8","v":{"$error":"#DIV/0!"}},{"$error":"#DIV/0!"},{"$error":"#DIV/0!"},{"$f":"U103*'Input Screen'!$C$21/1000000","v":{"$error":"#DIV/0!"}},9.7999999999999812,{"$error":"#VALUE!"},{"$error":"#VALUE!"},null,null,null,null,null,null,null,null,null,null,null,null,null,null,null,null,{"$f":"'Input Screen'!$C$8*5280*$AU$4*'Input Screen'!$C$9*2*(T103-$T$6)/12*0.0575","v":{"$error":"#DIV/0!"}},{"$error":"#DIV/0!"},{"$f":"AS103/($AU$4*'Input Screen'!$C$8)","v":{"$error":"#DIV/0!"}},{"$error":"#DIV/0!"},{"$error":"#DIV/0!"},{"$f":"AS103*'Input Screen'!$C$21/1000000","v":{"$error":"#DIV/0!"}},null,null,null,null,null,null,null,null,null,null,null,null,null,null,null,null,null,null,null,null,null,null,null,null,null,null,null,null,null,null,null,null,null,null,null,null,null,null,null,null,null,null,null,null,null,null,null,null,null,null,null,null,null,null,"Worth",5.0208709485809848E-3,32,1.68,3]
[null,null,null,null,null,null,null,null,null,null,null,null,null,null,null,null,null,null,null,{"$error":"#DIV/0!"},{"$f":"'Input Screen'!$C$8*5280*'Input Screen'!$C$9*2*(T104-$T$6)/12*0.0575","v":{"$error":"#DIV/0!"}},{"$f":"U104/'Input Screen'!$C$8","v":{"$error":"#DIV/0!"}},{"$error":"#DIV/0!"},{"$error":"#DIV/0!"},{"$f":"U104*'Input Screen'!$C$21/1000000","v":{"$error":"#DIV/0!"}},9.8999999999999808,{"$error":"#VALUE!"},{"$error":"#VALUE!"},null,null,null,null,null,null,null,null,null,null,null,null,null,null,null,null,{"$f":"'Input Screen'!$C$8*5280*$AU$4*'Input Screen'!$C$9*2*(T104-$T$6)/12*0.0575","v":{"$error":"#DIV/0!"}},{"$error":"#DIV/0!"},{"$f":"AS104/($AU$4*'Input Screen'!$C$8)","v":{"$error":"#DIV/0!"}},{"$error":"#DIV/0!"},{"$error":"#DIV/0!"},{"$f":"AS104*'Input Screen'!$C$21/1000000","v":{"$error":"#DIV/0!"}},null,null,null,null,null,null,null,null,null,null,null,null,null,null,null,null,null,null,null,null,null,null,null,null,null,null,null,null,null,null,null,null,null,null,null,null,null,null,null,null,null,null,null,null,null,null,null,null,null,null,null,null,null,null,"Wright",4.7807792934514244E-3,37,2.19,4]
[null,null,null,null,null,null,null,null,null,null,null,null,null,null,null,null,null,null,null,{"$error":"#DIV/0!"},{"$f":"'Input Screen'!$C$8*5280*'Input Screen'!$C$9*2*(T105-$T$6)/12*0.0575","v":{"$error":"#DIV/0!"}},{"$f":"U105/'Input Screen'!$C$8","v":{"$error":"#DIV/0!"}},{"$error":"#DIV/0!"},{"$error":"#DIV/0!"},{"$f":"U105*'Input Screen'!$C$21/1000000","v":{"$error":"#DIV/0!"}},9.9999999999999805,{"$error":"#VALUE!"},{"$error":"#VALUE!"},null,null,null,null,null,null,null,null,null,null,null,null,null,null,null,null,{"$f":"'Input Screen'!$C$8*5280*$AU$4*'Input Screen'!$C$9*2*(T105-$T$6)/12*0.0575","v":{"$error":"#DIV/0!"}},{"$error":"#DIV/0!"},{"$f":"AS105/($AU$4*'Input Screen'!$C$8)","v":{"$error":"#DIV/0!"}},{"$error":"#DIV/0!"},{"$error":"#DIV/0!"},{"$f":"AS105*'Input Screen'!$C$21/1000000","v":{"$error":"#DIV/0!"}}]
[null,null,null,null,null,null,null,null,null,null,null,null,null,null,null,null,null,null,null,{"$error":"#DIV/0!"},{"$f":"'Input Screen'!$C$8*5280*'Input Screen'!$C$9*2*(T106-$T$6)/12*0.0575","v":{"$error":"#DIV/0!"}},{"$f":"U106/'Input Screen'!$C$8","v":{"$error":"#DIV/0!"}},{"$error":"#DIV/0!"},{"$error":"#DIV/0!"},{"$f":"U106*'Input Screen'!$C$21/1000000","v":{"$error":"#DIV/0!"}},10.09999999999998,{"$error":"#VALUE!"},{"$error":"#VALUE!"},null,null,null,null,null,null,null,null,null,null,null,null,null,null,null,null,{"$f":"'Input Screen'!$C$8*5280*$AU$4*'Input Screen'!$C$9*2*(T106-$T$6)/12*0.0575","v":{"$error":"#DIV/0!"}},{"$error":"#DIV/0!"},{"$f":"AS106/($AU$4*'Input Screen'!$C$8)","v":{"$error":"#DIV/0!"}},{"$error":"#DIV/0!"},{"$error":"#DIV/0!"},{"$f":"AS106*'Input Screen'!$C$21/1000000","v":{"$error":"#DIV/0!"}}]
[null,null,null,null,null,null,null,null,null,null,null,null,null,null,null,null,null,null,null,{"$error":"#DIV/0!"},{"$f":"'Input Screen'!$C$8*5280*'Input Screen'!$C$9*2*(T107-$T$6)/12*0.0575","v":{"$error":"#DIV/0!"}},{"$f":"U107/'Input Screen'!$C$8","v":{"$error":"#DIV/0!"}},{"$error":"#DIV/0!"},{"$error":"#DIV/0!"},{"$f":"U107*'Input Screen'!$C$21/1000000","v":{"$error":"#DIV/0!"}},10.19999999999998,{"$error":"#VALUE!"},{"$error":"#VALUE!"},null,null,null,null,null,null,null,null,null,null,null,null,null,null,null,null,{"$f":"'Input Screen'!$C$8*5280*$AU$4*'Input Screen'!$C$9*2*(T107-$T$6)/12*0.0575","v":{"$error":"#DIV/0!"}},{"$error":"#DIV/0!"},{"$f":"AS107/($AU$4*'Input Screen'!$C$8)","v":{"$error":"#DIV/0!"}},{"$error":"#DIV/0!"},{"$error":"#DIV/0!"},{"$f":"AS107*'Input Screen'!$C$21/1000000","v":{"$error":"#DIV/0!"}}]
[null,null,null,null,null,null,null,null,null,null,null,null,null,null,null,null,null,null,null,{"$error":"#DIV/0!"},{"$f":"'Input Screen'!$C$8*5280*'Input Screen'!$C$9*2*(T108-$T$6)/12*0.0575","v":{"$error":"#DIV/0!"}},{"$f":"U108/'Input Screen'!$C$8","v":{"$error":"#DIV/0!"}},{"$error":"#DIV/0!"},{"$error":"#DIV/0!"},{"$f":"U108*'Input Screen'!$C$21/1000000","v":{"$error":"#DIV/0!"}},10.299999999999979,{"$error":"#VALUE!"},{"$error":"#VALUE!"},null,null,null,null,null,null,null,null,null,null,null,null,null,null,null,null,{"$f":"'Input Screen'!$C$8*5280*$AU$4*'Input Screen'!$C$9*2*(T108-$T$6)/12*0.0575","v":{"$error":"#DIV/0!"}},{"$error":"#DIV/0!"},{"$f":"AS108/($AU$4*'Input Screen'!$C$8)","v":{"$error":"#DIV/0!"}},{"$error":"#DIV/0!"},{"$error":"#DIV/0!"},{"$f":"AS108*'Input Screen'!$C$21/1000000","v":{"$error":"#DIV/0!"}}]
[null,null,null,null,null,null,null,null,null,null,null,null,null,null,null,null,null,null,null,{"$error":"#DIV/0!"},{"$f":"'Input Screen'!$C$8*5280*'Input Screen'!$C$9*2*(T109-$T$6)/12*0.0575","v":{"$error":"#DIV/0!"}},{"$f":"U109/'Input Screen'!$C$8","v":{"$error":"#DIV/0!"}},{"$error":"#DIV/0!"},{"$error":"#DIV/0!"},{"$f":"U109*'Input Screen'!$C$21/1000000","v":{"$error":"#DIV/0!"}},10.399999999999979,{"$error":"#VALUE!"},{"$error":"#VALUE!"},null,null,null,null,null,null,null,null,null,null,null,null,null,null,null,null,{"$f":"'Input Screen'!$C$8*5280*$AU$4*'Input Screen'!$C$9*2*(T109-$T$6)/12*0.0575","v":{"$error":"#DIV/0!"}},{"$error":"#DIV/0!"},{"$f":"AS109/($AU$4*'Input Screen'!$C$8)","v":{"$error":"#DIV/0!"}},{"$error":"#DIV/0!"},{"$error":"#DIV/0!"},{"$f":"AS109*'Input Screen'!$C$21/1000000","v":{"$error":"#DIV/0!"}}]
[null,null,null,null,null,null,null,null,null,null,null,null,null,null,null,null,null,null,null,{"$error":"#DIV/0!"},{"$f":"'Input Screen'!$C$8*5280*'Input Screen'!$C$9*2*(T110-$T$6)/12*0.0575","v":{"$error":"#DIV/0!"}},{"$f":"U110/'Input Screen'!$C$8","v":{"$error":"#DIV/0!"}},{"$error":"#DIV/0!"},{"$error":"#DIV/0!"},{"$f":"U110*'Input Screen'!$C$21/1000000","v":{"$error":"#DIV/0!"}},10.499999999999979,{"$error":"#VALUE!"},{"$error":"#VALUE!"},null,null,null,null,null,null,null,null,null,null,null,null,null,null,null,null,{"$f":"'Input Screen'!$C$8*5280*$AU$4*'Input Screen'!$C$9*2*(T110-$T$6)/12*0.0575","v":{"$error":"#DIV/0!"}},{"$error":"#DIV/0!"},{"$f":"AS110/($AU$4*'Input Screen'!$C$8)","v":{"$error":"#DIV/0!"}},{"$error":"#DIV/0!"},{"$error":"#DIV/0!"},{"$f":"AS110*'Input Screen'!$C$21/1000000","v":{"$error":"#DIV/0!"}}]
[null,null,null,null,null,null,null,null,null,null,null,null,null,null,null,null,null,null,null,{"$error":"#DIV/0!"},{"$f":"'Input Screen'!$C$8*5280*'Input Screen'!$C$9*2*(T111-$T$6)/12*0.0575","v":{"$error":"#DIV/0!"}},{"$f":"U111/'Input Screen'!$C$8","v":{"$error":"#DIV/0!"}},{"$error":"#DIV/0!"},{"$error":"#DIV/0!"},{"$f":"U111*'Input Screen'!$C$21/1000000","v":{"$error":"#DIV/0!"}},10.599999999999978,{"$error":"#VALUE!"},{"$error":"#VALUE!"},null,null,null,null,null,null,null,null,null,null,null,null,null,null,null,null,{"$f":"'Input Screen'!$C$8*5280*$AU$4*'Input Screen'!$C$9*2*(T111-$T$6)/12*0.0575","v":{"$error":"#DIV/0!"}},{"$error":"#DIV/0!"},{"$f":"AS111/($AU$4*'Input Screen'!$C$8)","v":{"$error":"#DIV/0!"}},{"$error":"#DIV/0!"},{"$error":"#DIV/0!"},{"$f":"AS111*'Input Screen'!$C$21/1000000","v":{"$error":"#DIV/0!"}}]
[null,null,null,null,null,null,null,null,null,null,null,null,null,null,null,null,null,null,null,{"$error":"#DIV/0!"},{"$f":"'Input Screen'!$C$8*5280*'Input Screen'!$C$9*2*(T112-$T$6)/12*0.0575","v":{"$error":"#DIV/0!"}},{"$f":"U112/'Input Screen'!$C$8","v":{"$error":"#DIV/0!"}},{"$error":"#DIV/0!"},{"$error":"#DIV/0!"},{"$f":"U112*'Input Screen'!$C$21/1000000","v":{"$error":"#DIV/0!"}},10.699999999999978,{"$error":"#VALUE!"},{"$error":"#VALUE!"},null,null,null,null,null,null,null,null,null,null,null,null,null,null,null,null,{"$f":"'Input Screen'!$C$8*5280*$AU$4*'Input Screen'!$C$9*2*(T112-$T$6)/12*0.0575","v":{"$error":"#DIV/0!"}},{"$error":"#DIV/0!"},{"$f":"AS112/($AU$4*'Input Screen'!$C$8)","v":{"$error":"#DIV/0!"}},{"$error":"#DIV/0!"},{"$error":"#DIV/0!"},{"$f":"AS112*'Input Screen'!$C$21/1000000","v":{"$error":"#DIV/0!"}}]
[null,null,null,null,null,null,null,null,null,null,null,null,null,null,null,null,null,null,null,{"$error":"#DIV/0!"},{"$f":"'Input Screen'!$C$8*5280*'Input Screen'!$C$9*2*(T113-$T$6)/12*0.0575","v":{"$error":"#DIV/0!"}},{"$f":"U113/'Input Screen'!$C$8","v":{"$error":"#DIV/0!"}},{"$error":"#DIV/0!"},{"$error":"#DIV/0!"},{"$f":"U113*'Input Screen'!$C$21/1000000","v":{"$error":"#DIV/0!"}},10.799999999999978,{"$error":"#VALUE!"},{"$error":"#VALUE!"},null,null,null,null,null,null,null,null,null,null,null,null,null,null,null,null,{"$f":"'Input Screen'!$C$8*5280*$AU$4*'Input Screen'!$C$9*2*(T113-$T$6)/12*0.0575","v":{"$error":"#DIV/0!"}},{"$error":"#DIV/0!"},{"$f":"AS113/($AU$4*'Input Screen'!$C$8)","v":{"$error":"#DIV/0!"}},{"$error":"#DIV/0!"},{"$error":"#DIV/0!"},{"$f":"AS113*'Input Screen'!$C$21/1000000","v":{"$error":"#DIV/0!"}}]
[null,null,null,null,null,null,null,null,null,null,null,null,null,null,null,null,null,null,null,{"$error":"#DIV/0!"},{"$f":"'Input Screen'!$C$8*5280*'Input Screen'!$C$9*2*(T114-$T$6)/12*0.0575","v":{"$error":"#DIV/0!"}},{"$f":"U114/'Input Screen'!$C$8","v":{"$error":"#DIV/0!"}},{"$error":"#DIV/0!"},{"$error":"#DIV/0!"},{"$f":"U114*'Input Screen'!$C$21/1000000","v":{"$error":"#DIV/0!"}},10.899999999999977,{"$error":"#VALUE!"},{"$error":"#VALUE!"},null,null,null,null,null,null,null,null,null,null,null,null,null,null,null,null,{"$f":"'Input Screen'!$C$8*5280*$AU$4*'Input Screen'!$C$9*2*(T114-$T$6)/12*0.0575","v":{"$error":"#DIV/0!"}},{"$error":"#DIV/0!"},{"$f":"AS114/($AU$4*'Input Screen'!$C$8)","v":{"$error":"#DIV/0!"}},{"$error":"#DIV/0!"},{"$error":"#DIV/0!"},{"$f":"AS114*'Input Screen'!$C$21/1000000","v":{"$error":"#DIV/0!"}}]
[null,null,null,null,null,null,null,null,null,null,null,null,null,null,null,null,null,null,null,{"$error":"#DIV/0!"},{"$f":"'Input Screen'!$C$8*5280*'Input Screen'!$C$9*2*(T115-$T$6)/12*0.0575","v":{"$error":"#DIV/0!"}},{"$f":"U115/'Input Screen'!$C$8","v":{"$error":"#DIV/0!"}},{"$error":"#DIV/0!"},{"$error":"#DIV/0!"},{"$f":"U115*'Input Screen'!$C$21/1000000","v":{"$error":"#DIV/0!"}},10.999999999999977,{"$error":"#VALUE!"},{"$error":"#VALUE!"},null,null,null,null,null,null,null,null,null,null,null,null,null,null,null,null,{"$f":"'Input Screen'!$C$8*5280*$AU$4*'Input Screen'!$C$9*2*(T115-$T$6)/12*0.0575","v":{"$error":"#DIV/0!"}},{"$error":"#DIV/0!"},{"$f":"AS115/($AU$4*'Input Screen'!$C$8)","v":{"$error":"#DIV/0!"}},{"$error":"#DIV/0!"},{"$error":"#DIV/0!"},{"$f":"AS115*'Input Screen'!$C$21/1000000","v":{"$error":"#DIV/0!"}}]
[null,null,null,null,null,null,null,null,null,null,null,null,null,null,null,null,null,null,null,{"$error":"#DIV/0!"},{"$f":"'Input Screen'!$C$8*5280*'Input Screen'!$C$9*2*(T116-$T$6)/12*0.0575","v":{"$error":"#DIV/0!"}},{"$f":"U116/'Input Screen'!$C$8","v":{"$error":"#DIV/0!"}},{"$error":"#DIV/0!"},{"$error":"#DIV/0!"},{"$f":"U116*'Input Screen'!$C$21/1000000","v":{"$error":"#DIV/0!"}},11.099999999999977,{"$error":"#VALUE!"},{"$error":"#VALUE!"},null,null,null,null,null,null,null,null,null,null,null,null,null,null,null,null,{"$f":"'Input Screen'!$C$8*5280*$AU$4*'Input Screen'!$C$9*2*(T116-$T$6)/12*0.0575","v":{"$error":"#DIV/0!"}},{"$error":"#DIV/0!"},{"$f":"AS116/($AU$4*'Input Screen'!$C$8)","v":{"$error":"#DIV/0!"}},{"$error":"#DIV/0!"},{"$error":"#DIV/0!"},{"$f":"AS116*'Input Screen'!$C$21/1000000","v":{"$error":"#DIV/0!"}}]
[null,null,null,null,null,null,null,null,null,null,null,null,null,null,null,null,null,null,null,{"$error":"#DIV/0!"},{"$f":"'Input Screen'!$C$8*5280*'Input Screen'!$C$9*2*(T117-$T$6)/12*0.0575","v":{"$error":"#DIV/0!"}},{"$f":"U117/'Input Screen'!$C$8","v":{"$error":"#DIV/0!"}},{"$error":"#DIV/0!"},{"$error":"#DIV/0!"},{"$f":"U117*'Input Screen'!$C$21/1000000","v":{"$error":"#DIV/0!"}},11.199999999999976,{"$error":"#VALUE!"},{"$error":"#VALUE!"},null,null,null,null,null,null,null,null,null,null,null,null,null,null,null,null,{"$f":"'Input Screen'!$C$8*5280*$AU$4*'Input Screen'!$C$9*2*(T117-$T$6)/12*0.0575","v":{"$error":"#DIV/0!"}},{"$error":"#DIV/0!"},{"$f":"AS117/($AU$4*'Input Screen'!$C$8)","v":{"$error":"#DIV/0!"}},{"$error":"#DIV/0!"},{"$error":"#DIV/0!"},{"$f":"AS117*'Input Screen'!$C$21/1000000","v":{"$error":"#DIV/0!"}}]
[null,null,null,null,null,null,null,null,null,null,null,null,null,null,null,null,null,null,null,{"$error":"#DIV/0!"},{"$f":"'Input Screen'!$C$8*5280*'Input Screen'!$C$9*2*(T118-$T$6)/12*0.0575","v":{"$error":"#DIV/0!"}},{"$f":"U118/'Input Screen'!$C$8","v":{"$error":"#DIV/0!"}},{"$error":"#DIV/0!"},{"$error":"#DIV/0!"},{"$f":"U118*'Input Screen'!$C$21/1000000","v":{"$error":"#DIV/0!"}},11.299999999999976,{"$error":"#VALUE!"},{"$error":"#VALUE!"},null,null,null,null,null,null,null,null,null,null,null,null,null,null,null,null,{"$f":"'Input Screen'!$C$8*5280*$AU$4*'Input Screen'!$C$9*2*(T118-$T$6)/12*0.0575","v":{"$error":"#DIV/0!"}},{"$error":"#DIV/0!"},{"$f":"AS118/($AU$4*'Input Screen'!$C$8)","v":{"$error":"#DIV/0!"}},{"$error":"#DIV/0!"},{"$error":"#DIV/0!"},{"$f":"AS118*'Input Screen'!$C$21/1000000","v":{"$error":"#DIV/0!"}}]
[null,null,null,null,null,null,null,null,null,null,null,null,null,null,null,null,null,null,null,{"$error":"#DIV/0!"},{"$f":"'Input Screen'!$C$8*5280*'Input Screen'!$C$9*2*(T119-$T$6)/12*0.0575","v":{"$error":"#DIV/0!"}},{"$f":"U119/'Input Screen'!$C$8","v":{"$error":"#DIV/0!"}},{"$error":"#DIV/0!"},{"$error":"#DIV/0!"},{"$f":"U119*'Input Screen'!$C$21/1000000","v":{"$error":"#DIV/0!"}},11.399999999999975,{"$error":"#VALUE!"},{"$error":"#VALUE!"},null,null,null,null,null,null,null,null,null,null,null,null,null,null,null,null,{"$f":"'Input Screen'!$C$8*5280*$AU$4*'Input Screen'!$C$9*2*(T119-$T$6)/12*0.0575","v":{"$error":"#DIV/0!"}},{"$error":"#DIV/0!"},{"$f":"AS119/($AU$4*'Input Screen'!$C$8)","v":{"$error":"#DIV/0!"}},{"$error":"#DIV/0!"},{"$error":"#DIV/0!"},{"$f":"AS119*'Input Screen'!$C$21/1000000","v":{"$error":"#DIV/0!"}}]
[null,null,null,null,null,null,null,null,null,null,null,null,null,null,null,null,null,null,null,{"$error":"#DIV/0!"},{"$f":"'Input Screen'!$C$8*5280*'Input Screen'!$C$9*2*(T120-$T$6)/12*0.0575","v":{"$error":"#DIV/0!"}},{"$f":"U120/'Input Screen'!$C$8","v":{"$error":"#DIV/0!"}},{"$error":"#DIV/0!"},{"$error":"#DIV/0!"},{"$f":"U120*'Input Screen'!$C$21/1000000","v":{"$error":"#DIV/0!"}},11.499999999999975,{"$error":"#VALUE!"},{"$error":"#VALUE!"},null,null,null,null,null,null,null,null,null,null,null,null,null,null,null,null,{"$f":"'Input Screen'!$C$8*5280*$AU$4*'Input Screen'!$C$9*2*(T120-$T$6)/12*0.0575","v":{"$error":"#DIV/0!"}},{"$error":"#DIV/0!"},{"$f":"AS120/($AU$4*'Input Screen'!$C$8)","v":{"$error":"#DIV/0!"}},{"$error":"#DIV/0!"},{"$error":"#DIV/0!"},{"$f":"AS120*'Input Screen'!$C$21/1000000","v":{"$error":"#DIV/0!"}}]
[null,null,null,null,null,null,null,null,null,null,null,null,null,null,null,null,null,null,null,{"$error":"#DIV/0!"},{"$f":"'Input Screen'!$C$8*5280*'Input Screen'!$C$9*2*(T121-$T$6)/12*0.0575","v":{"$error":"#DIV/0!"}},{"$f":"U121/'Input Screen'!$C$8","v":{"$error":"#DIV/0!"}},{"$error":"#DIV/0!"},{"$error":"#DIV/0!"},{"$f":"U121*'Input Screen'!$C$21/1000000","v":{"$error":"#DIV/0!"}},11.599999999999975,{"$error":"#VALUE!"},{"$error":"#VALUE!"},null,null,null,null,null,null,null,null,null,null,null,null,null,null,null,null,{"$f":"'Input Screen'!$C$8*5280*$AU$4*'Input Screen'!$C$9*2*(T121-$T$6)/12*0.0575","v":{"$error":"#DIV/0!"}},{"$error":"#DIV/0!"},{"$f":"AS121/($AU$4*'Input Screen'!$C$8)","v":{"$error":"#DIV/0!"}},{"$error":"#DIV/0!"},{"$error":"#DIV/0!"},{"$f":"AS121*'Input Screen'!$C$21/1000000","v":{"$error":"#DIV/0!"}}]
[null,null,null,null,null,null,null,null,null,null,null,null,null,null,null,null,null,null,null,{"$error":"#DIV/0!"},{"$f":"'Input Screen'!$C$8*5280*'Input Screen'!$C$9*2*(T122-$T$6)/12*0.0575","v":{"$error":"#DIV/0!"}},{"$f":"U122/'Input Screen'!$C$8","v":{"$error":"#DIV/0!"}},{"$error":"#DIV/0!"},{"$error":"#DIV/0!"},{"$f":"U122*'Input Screen'!$C$21/1000000","v":{"$error":"#DIV/0!"}},11.699999999999974,{"$error":"#VALUE!"},{"$error":"#VALUE!"},null,null,null,null,null,null,null,null,null,null,null,null,null,null,null,null,{"$f":"'Input Screen'!$C$8*5280*$AU$4*'Input Screen'!$C$9*2*(T122-$T$6)/12*0.0575","v":{"$error":"#DIV/0!"}},{"$error":"#DIV/0!"},{"$f":"AS122/($AU$4*'Input Screen'!$C$8)","v":{"$error":"#DIV/0!"}},{"$error":"#DIV/0!"},{"$error":"#DIV/0!"},{"$f":"AS122*'Input Screen'!$C$21/1000000","v":{"$error":"#DIV/0!"}}]
[null,null,null,null,null,null,null,null,null,null,null,null,null,null,null,null,null,null,null,{"$error":"#DIV/0!"},{"$f":"'Input Screen'!$C$8*5280*'Input Screen'!$C$9*2*(T123-$T$6)/12*0.0575","v":{"$error":"#DIV/0!"}},{"$f":"U123/'Input Screen'!$C$8","v":{"$error":"#DIV/0!"}},{"$error":"#DIV/0!"},{"$error":"#DIV/0!"},{"$f":"U123*'Input Screen'!$C$21/1000000","v":{"$error":"#DIV/0!"}},11.799999999999974,{"$error":"#VALUE!"},{"$error":"#VALUE!"},null,null,null,null,null,null,null,null,null,null,null,null,null,null,null,null,{"$f":"'Input Screen'!$C$8*5280*$AU$4*'Input Screen'!$C$9*2*(T123-$T$6)/12*0.0575","v":{"$error":"#DIV/0!"}},{"$error":"#DIV/0!"},{"$f":"AS123/($AU$4*'Input Screen'!$C$8)","v":{"$error":"#DIV/0!"}},{"$error":"#DIV/0!"},{"$error":"#DIV/0!"},{"$f":"AS123*'Input Screen'!$C$21/1000000","v":{"$error":"#DIV/0!"}}]
[null,null,null,null,null,null,null,null,null,null,null,null,null,null,null,null,null,null,null,{"$error":"#DIV/0!"},{"$f":"'Input Screen'!$C$8*5280*'Input Screen'!$C$9*2*(T124-$T$6)/12*0.0575","v":{"$error":"#DIV/0!"}},{"$f":"U124/'Input Screen'!$C$8","v":{"$error":"#DIV/0!"}},{"$error":"#DIV/0!"},{"$error":"#DIV/0!"},{"$f":"U124*'Input Screen'!$C$21/1000000","v":{"$error":"#DIV/0!"}},11.899999999999974,{"$error":"#VALUE!"},{"$error":"#VALUE!"},null,null,null,null,null,null,null,null,null,null,null,null,null,null,null,null,{"$f":"'Input Screen'!$C$8*5280*$AU$4*'Input Screen'!$C$9*2*(T124-$T$6)/12*0.0575","v":{"$error":"#DIV/0!"}},{"$error":"#DIV/0!"},{"$f":"AS124/($AU$4*'Input Screen'!$C$8)","v":{"$error":"#DIV/0!"}},{"$error":"#DIV/0!"},{"$error":"#DIV/0!"},{"$f":"AS124*'Input Screen'!$C$21/1000000","v":{"$error":"#DIV/0!"}}]
[null,null,null,null,null,null,null,null,null,null,null,null,null,null,null,null,null,null,null,{"$error":"#DIV/0!"},{"$f":"'Input Screen'!$C$8*5280*'Input Screen'!$C$9*2*(T125-$T$6)/12*0.0575","v":{"$error":"#DIV/0!"}},{"$f":"U125/'Input Screen'!$C$8","v":{"$error":"#DIV/0!"}},{"$error":"#DIV/0!"},{"$error":"#DIV/0!"},{"$f":"U125*'Input Screen'!$C$21/1000000","v":{"$error":"#DIV/0!"}},11.999999999999973,{"$error":"#VALUE!"},{"$error":"#VALUE!"},null,null,null,null,null,null,null,null,null,null,null,null,null,null,null,null,{"$f":"'Input Screen'!$C$8*5280*$AU$4*'Input Screen'!$C$9*2*(T125-$T$6)/12*0.0575","v":{"$error":"#DIV/0!"}},{"$error":"#DIV/0!"},{"$f":"AS125/($AU$4*'Input Screen'!$C$8)","v":{"$error":"#DIV/0!"}},{"$error":"#DIV/0!"},{"$error":"#DIV/0!"},{"$f":"AS125*'Input Screen'!$C$21/1000000","v":{"$error":"#DIV/0!"}}]
[null,null,null,null,null,null,null,null,null,null,null,null,null,null,null,null,null,null,null,{"$error":"#DIV/0!"},{"$f":"'Input Screen'!$C$8*5280*'Input Screen'!$C$9*2*(T126-$T$6)/12*0.0575","v":{"$error":"#DIV/0!"}},{"$f":"U126/'Input Screen'!$C$8","v":{"$error":"#DIV/0!"}},{"$error":"#DIV/0!"},{"$error":"#DIV/0!"},{"$f":"U126*'Input Screen'!$C$21/1000000","v":{"$error":"#DIV/0!"}},12.099999999999973,{"$error":"#VALUE!"},{"$error":"#VALUE!"},null,null,null,null,null,null,null,null,null,null,null,null,null,null,null,null,{"$f":"'Input Screen'!$C$8*5280*$AU$4*'Input Screen'!$C$9*2*(T126-$T$6)/12*0.0575","v":{"$error":"#DIV/0!"}},{"$error":"#DIV/0!"},{"$f":"AS126/($AU$4*'Input Screen'!$C$8)","v":{"$error":"#DIV/0!"}},{"$error":"#DIV/0!"},{"$error":"#DIV/0!"},{"$f":"AS126*'Input Screen'!$C$21/1000000","v":{"$error":"#DIV/0!"}}]
[null,null,null,null,null,null,null,null,null,null,null,null,null,null,null,null,null,null,null,{"$error":"#DIV/0!"},{"$f":"'Input Screen'!$C$8*5280*'Input Screen'!$C$9*2*(T127-$T$6)/12*0.0575","v":{"$error":"#DIV/0!"}},{"$f":"U127/'Input Screen'!$C$8","v":{"$error":"#DIV/0!"}},{"$error":"#DIV/0!"},{"$error":"#DIV/0!"},{"$f":"U127*'Input Screen'!$C$21/1000000","v":{"$error":"#DIV/0!"}},12.199999999999973,{"$error":"#VALUE!"},{"$error":"#VALUE!"},null,null,null,null,null,null,null,null,null,null,null,null,null,null,null,null,{"$f":"'Input Screen'!$C$8*5280*$AU$4*'Input Screen'!$C$9*2*(T127-$T$6)/12*0.0575","v":{"$error":"#DIV/0!"}},{"$error":"#DIV/0!"},{"$f":"AS127/($AU$4*'Input Screen'!$C$8)","v":{"$error":"#DIV/0!"}},{"$error":"#DIV/0!"},{"$error":"#DIV/0!"},{"$f":"AS127*'Input Screen'!$C$21/1000000","v":{"$error":"#DIV/0!"}}]
[null,null,null,null,null,null,null,null,null,null,null,null,null,null,null,null,null,null,null,{"$error":"#DIV/0!"},{"$f":"'Input Screen'!$C$8*5280*'Input Screen'!$C$9*2*(T128-$T$6)/12*0.0575","v":{"$error":"#DIV/0!"}},{"$f":"U128/'Input Screen'!$C$8","v":{"$error":"#DIV/0!"}},{"$error":"#DIV/0!"},{"$error":"#DIV/0!"},{"$f":"U128*'Input Screen'!$C$21/1000000","v":{"$error":"#DIV/0!"}},12.299999999999972,{"$error":"#VALUE!"},{"$error":"#VALUE!"},null,null,null,null,null,null,null,null,null,null,null,null,null,null,null,null,{"$f":"'Input Screen'!$C$8*5280*$AU$4*'Input Screen'!$C$9*2*(T128-$T$6)/12*0.0575","v":{"$error":"#DIV/0!"}},{"$error":"#DIV/0!"},{"$f":"AS128/($AU$4*'Input Screen'!$C$8)","v":{"$error":"#DIV/0!"}},{"$error":"#DIV/0!"},{"$error":"#DIV/0!"},{"$f":"AS128*'Input Screen'!$C$21/1000000","v":{"$error":"#DIV/0!"}}]
[null,null,null,null,null,null,null,null,null,null,null,null,null,null,null,null,null,null,null,{"$error":"#DIV/0!"},{"$f":"'Input Screen'!$C$8*5280*'Input Screen'!$C$9*2*(T129-$T$6)/12*0.0575","v":{"$error":"#DIV/0!"}},{"$f":"U129/'Input Screen'!$C$8","v":{"$error":"#DIV/0!"}},{"$error":"#DIV/0!"},{"$error":"#DIV/0!"},{"$f":"U129*'Input Screen'!$C$21/1000000","v":{"$error":"#DIV/0!"}},12.399999999999972,{"$error":"#VALUE!"},{"$error":"#VALUE!"},null,null,null,null,null,null,null,null,null,null,null,null,null,null,null,null,{"$f":"'Input Screen'!$C$8*5280*$AU$4*'Input Screen'!$C$9*2*(T129-$T$6)/12*0.0575","v":{"$error":"#DIV/0!"}},{"$error":"#DIV/0!"},{"$f":"AS129/($AU$4*'Input Screen'!$C$8)","v":{"$error":"#DIV/0!"}},{"$error":"#DIV/0!"},{"$error":"#DIV/0!"},{"$f":"AS129*'Input Screen'!$C$21/1000000","v":{"$error":"#DIV/0!"}}]
[null,null,null,null,null,null,null,null,null,null,null,null,null,null,null,null,null,null,null,{"$error":"#DIV/0!"},{"$f":"'Input Screen'!$C$8*5280*'Input Screen'!$C$9*2*(T130-$T$6)/12*0.0575","v":{"$error":"#DIV/0!"}},{"$f":"U130/'Input Screen'!$C$8","v":{"$error":"#DIV/0!"}},{"$error":"#DIV/0!"},{"$error":"#DIV/0!"},{"$f":"U130*'Input Screen'!$C$21/1000000","v":{"$error":"#DIV/0!"}},12.499999999999972,{"$error":"#VALUE!"},{"$error":"#VALUE!"},null,null,null,null,null,null,null,null,null,null,null,null,null,null,null,null,{"$f":"'Input Screen'!$C$8*5280*$AU$4*'Input Screen'!$C$9*2*(T130-$T$6)/12*0.0575","v":{"$error":"#DIV/0!"}},{"$error":"#DIV/0!"},{"$f":"AS130/($AU$4*'Input Screen'!$C$8)","v":{"$error":"#DIV/0!"}},{"$error":"#DIV/0!"},{"$error":"#DIV/0!"},{"$f":"AS130*'Input Screen'!$C$21/1000000","v":{"$error":"#DIV/0!"}}]
[null,null,null,null,null,null,null,null,null,null,null,null,null,null,null,null,null,null,null,{"$error":"#DIV/0!"},{"$f":"'Input Screen'!$C$8*5280*'Input Screen'!$C$9*2*(T131-$T$6)/12*0.0575","v":{"$error":"#DIV/0!"}},{"$f":"U131/'Input Screen'!$C$8","v":{"$error":"#DIV/0!"}},{"$error":"#DIV/0!"},{"$error":"#DIV/0!"},{"$f":"U131*'Input Screen'!$C$21/1000000","v":{"$error":"#DIV/0!"}},12.599999999999971,{"$error":"#VALUE!"},{"$error":"#VALUE!"},null,null,null,null,null,null,null,null,null,null,null,null,null,null,null,null,{"$f":"'Input Screen'!$C$8*5280*$AU$4*'Input Screen'!$C$9*2*(T131-$T$6)/12*0.0575","v":{"$error":"#DIV/0!"}},{"$error":"#DIV/0!"},{"$f":"AS131/($AU$4*'Input Screen'!$C$8)","v":{"$error":"#DIV/0!"}},{"$error":"#DIV/0!"},{"$error":"#DIV/0!"},{"$f":"AS131*'Input Screen'!$C$21/1000000","v":{"$error":"#DIV/0!"}}]
[null,null,null,null,null,null,null,null,null,null,null,null,null,null,null,null,null,null,null,{"$error":"#DIV/0!"},{"$f":"'Input Screen'!$C$8*5280*'Input Screen'!$C$9*2*(T132-$T$6)/12*0.0575","v":{"$error":"#DIV/0!"}},{"$f":"U132/'Input Screen'!$C$8","v":{"$error":"#DIV/0!"}},{"$error":"#DIV/0!"},{"$error":"#DIV/0!"},{"$f":"U132*'Input Screen'!$C$21/1000000","v":{"$error":"#DIV/0!"}},12.699999999999971,{"$error":"#VALUE!"},{"$error":"#VALUE!"},null,null,null,null,null,null,null,null,null,null,null,null,null,null,null,null,{"$f":"'Input Screen'!$C$8*5280*$AU$4*'Input Screen'!$C$9*2*(T132-$T$6)/12*0.0575","v":{"$error":"#DIV/0!"}},{"$error":"#DIV/0!"},{"$f":"AS132/($AU$4*'Input Screen'!$C$8)","v":{"$error":"#DIV/0!"}},{"$error":"#DIV/0!"},{"$error":"#DIV/0!"},{"$f":"AS132*'Input Screen'!$C$21/1000000","v":{"$error":"#DIV/0!"}}]
[null,null,null,null,null,null,null,null,null,null,null,null,null,null,null,null,null,null,null,{"$error":"#DIV/0!"},{"$f":"'Input Screen'!$C$8*5280*'Input Screen'!$C$9*2*(T133-$T$6)/12*0.0575","v":{"$error":"#DIV/0!"}},{"$f":"U133/'Input Screen'!$C$8","v":{"$error":"#DIV/0!"}},{"$error":"#DIV/0!"},{"$error":"#DIV/0!"},{"$f":"U133*'Input Screen'!$C$21/1000000","v":{"$error":"#DIV/0!"}},12.799999999999971,{"$error":"#VALUE!"},{"$error":"#VALUE!"},null,null,null,null,null,null,null,null,null,null,null,null,null,null,null,null,{"$f":"'Input Screen'!$C$8*5280*$AU$4*'Input Screen'!$C$9*2*(T133-$T$6)/12*0.0575","v":{"$error":"#DIV/0!"}},{"$error":"#DIV/0!"},{"$f":"AS133/($AU$4*'Input Screen'!$C$8)","v":{"$error":"#DIV/0!"}},{"$error":"#DIV/0!"},{"$error":"#DIV/0!"},{"$f":"AS133*'Input Screen'!$C$21/1000000","v":{"$error":"#DIV/0!"}}]
[null,null,null,null,null,null,null,null,null,null,null,null,null,null,null,null,null,null,null,{"$error":"#DIV/0!"},{"$f":"'Input Screen'!$C$8*5280*'Input Screen'!$C$9*2*(T134-$T$6)/12*0.0575","v":{"$error":"#DIV/0!"}},{"$f":"U134/'Input Screen'!$C$8","v":{"$error":"#DIV/0!"}},{"$error":"#DIV/0!"},{"$error":"#DIV/0!"},{"$f":"U134*'Input Screen'!$C$21/1000000","v":{"$error":"#DIV/0!"}},12.89999999999997,{"$error":"#VALUE!"},{"$error":"#VALUE!"},null,null,null,null,null,null,null,null,null,null,null,null,null,null,null,null,{"$f":"'Input Screen'!$C$8*5280*$AU$4*'Input Screen'!$C$9*2*(T134-$T$6)/12*0.0575","v":{"$error":"#DIV/0!"}},{"$error":"#DIV/0!"},{"$f":"AS134/($AU$4*'Input Screen'!$C$8)","v":{"$error":"#DIV/0!"}},{"$error":"#DIV/0!"},{"$error":"#DIV/0!"},{"$f":"AS134*'Input Screen'!$C$21/1000000","v":{"$error":"#DIV/0!"}}]
[null,null,null,null,null,null,null,null,null,null,null,null,null,null,null,null,null,null,null,{"$error":"#DIV/0!"},{"$f":"'Input Screen'!$C$8*5280*'Input Screen'!$C$9*2*(T135-$T$6)/12*0.0575","v":{"$error":"#DIV/0!"}},{"$f":"U135/'Input Screen'!$C$8","v":{"$error":"#DIV/0!"}},{"$f":"1-(_xlfn.NORM.S.DIST((T135-$BA$6)/((MAX($T$6:$T$306)-$BA$6)/6),TRUE))","v":{"$error":"#DIV/0!"}},{"$f":"U135*$R$6/1000000","v":{"$error":"#DIV/0!"}},{"$f":"U135*'Input Screen'!$C$21/1000000","v":{"$error":"#DIV/0!"}},12.99999999999997,{"$f":"(_xlfn.WEIBULL.DIST(Z135,$M$6,$M$7,TRUE))","v":{"$error":"#VALUE!"}},{"$f":"1-AA135","v":{"$error":"#VALUE!"}},null,null,null,null,null,null,null,null,null,null,null,null,null,null,null,null,{"$f":"'Input Screen'!$C$8*5280*$AU$4*'Input Screen'!$C$9*2*(T135-$T$6)/12*0.0575","v":{"$error":"#DIV/0!"}},{"$error":"#DIV/0!"},{"$f":"AS135/($AU$4*'Input Screen'!$C$8)","v":{"$error":"#DIV/0!"}},{"$f":"1-(_xlfn.NORM.S.DIST((AT135-$BA$6)/((MAX($T$6:$T$306)-$BA$6)/6),TRUE))","v":{"$error":"#DIV/0!"}},{"$f":"AS135*$R$6/1000000","v":{"$error":"#DIV/0!"}},{"$f":"AS135*'Input Screen'!$C$21/1000000","v":{"$error":"#DIV/0!"}}]
[null,null,null,null,null,null,null,null,null,null,null,null,null,null,null,null,null,null,null,{"$f":"IF(T135>=5,5,T135+0.01)","v":{"$error":"#DIV/0!"}},{"$f":"'Input Screen'!$C$8*5280*'Input Screen'!$C$9*2*(T136-$T$6)/12*0.0575","v":{"$error":"#DIV/0!"}},{"$f":"U136/'Input Screen'!$C$8","v":{"$error":"#DIV/0!"}},{"$error":"#DIV/0!"},{"$error":"#DIV/0!"},{"$f":"U136*'Input Screen'!$C$21/1000000","v":{"$error":"#DIV/0!"}},{"$f":"Z135+0.1","v":13.099999999999969},{"$error":"#VALUE!"},{"$error":"#VALUE!"},null,null,null,null,null,null,null,null,null,null,null,null,null,null,null,null,{"$f":"'Input Screen'!$C$8*5280*$AU$4*'Input Screen'!$C$9*2*(T136-$T$6)/12*0.0575","v":{"$error":"#DIV/0!"}},{"$f":"IF(AT135>=5,5,AT135+0.01)","v":{"$error":"#DIV/0!"}},{"$f":"AS136/($AU$4*'Input Screen'!$C$8)","v":{"$error":"#DIV/0!"}},{"$error":"#DIV/0!"},{"$error":"#DIV/0!"},{"$f":"AS136*'Input Screen'!$C$21/1000000","v":{"$error":"#DIV/0!"}}]
[null,null,null,null,null,null,null,null,null,null,null,null,null,null,null,null,null,null,null,{"$error":"#DIV/0!"},{"$f":"'Input Screen'!$C$8*5280*'Input Screen'!$C$9*2*(T137-$T$6)/12*0.0575","v":{"$error":"#DIV/0!"}},{"$f":"U137/'Input Screen'!$C$8","v":{"$error":"#DIV/0!"}},{"$error":"#DIV/0!"},{"$error":"#DIV/0!"},{"$f":"U137*'Input Screen'!$C$21/1000000","v":{"$error":"#DIV/0!"}},13.199999999999969,{"$error":"#VALUE!"},{"$error":"#VALUE!"},null,null,null,null,null,null,null,null,null,null,null,null,null,null,null,null,{"$f":"'Input Screen'!$C$8*5280*$AU$4*'Input Screen'!$C$9*2*(T137-$T$6)/12*0.0575","v":{"$error":"#DIV/0!"}},{"$error":"#DIV/0!"},{"$f":"AS137/($AU$4*'Input Screen'!$C$8)","v":{"$error":"#DIV/0!"}},{"$error":"#DIV/0!"},{"$error":"#DIV/0!"},{"$f":"AS137*'Input Screen'!$C$21/1000000","v":{"$error":"#DIV/0!"}}]
[null,null,null,null,null,null,null,null,null,null,null,null,null,null,null,null,null,null,null,{"$error":"#DIV/0!"},{"$f":"'Input Screen'!$C$8*5280*'Input Screen'!$C$9*2*(T138-$T$6)/12*0.0575","v":{"$error":"#DIV/0!"}},{"$f":"U138/'Input Screen'!$C$8","v":{"$error":"#DIV/0!"}},{"$error":"#DIV/0!"},{"$error":"#DIV/0!"},{"$f":"U138*'Input Screen'!$C$21/1000000","v":{"$error":"#DIV/0!"}},13.299999999999969,{"$error":"#VALUE!"},{"$error":"#VALUE!"},null,null,null,null,null,null,null,null,null,null,null,null,null,null,null,null,{"$f":"'Input Screen'!$C$8*5280*$AU$4*'Input Screen'!$C$9*2*(T138-$T$6)/12*0.0575","v":{"$error":"#DIV/0!"}},{"$error":"#DIV/0!"},{"$f":"AS138/($AU$4*'Input Screen'!$C$8)","v":{"$error":"#DIV/0!"}},{"$error":"#DIV/0!"},{"$error":"#DIV/0!"},{"$f":"AS138*'Input Screen'!$C$21/1000000","v":{"$error":"#DIV/0!"}}]
[null,null,null,null,null,null,null,null,null,null,null,null,null,null,null,null,null,null,null,{"$error":"#DIV/0!"},{"$f":"'Input Screen'!$C$8*5280*'Input Screen'!$C$9*2*(T139-$T$6)/12*0.0575","v":{"$error":"#DIV/0!"}},{"$f":"U139/'Input Screen'!$C$8","v":{"$error":"#DIV/0!"}},{"$error":"#DIV/0!"},{"$error":"#DIV/0!"},{"$f":"U139*'Input Screen'!$C$21/1000000","v":{"$error":"#DIV/0!"}},13.399999999999968,{"$error":"#VALUE!"},{"$error":"#VALUE!"},null,null,null,null,null,null,null,null,null,null,null,null,null,null,null,null,{"$f":"'Input Screen'!$C$8*5280*$AU$4*'Input Screen'!$C$9*2*(T139-$T$6)/12*0.0575","v":{"$error":"#DIV/0!"}},{"$error":"#DIV/0!"},{"$f":"AS139/($AU$4*'Input Screen'!$C$8)","v":{"$error":"#DIV/0!"}},{"$error":"#DIV/0!"},{"$error":"#DIV/0!"},{"$f":"AS139*'Input Screen'!$C$21/1000000","v":{"$error":"#DIV/0!"}}]
[null,null,null,null,null,null,null,null,null,null,null,null,null,null,null,null,null,null,null,{"$error":"#DIV/0!"},{"$f":"'Input Screen'!$C$8*5280*'Input Screen'!$C$9*2*(T140-$T$6)/12*0.0575","v":{"$error":"#DIV/0!"}},{"$f":"U140/'Input Screen'!$C$8","v":{"$error":"#DIV/0!"}},{"$error":"#DIV/0!"},{"$error":"#DIV/0!"},{"$f":"U140*'Input Screen'!$C$21/1000000","v":{"$error":"#DIV/0!"}},13.499999999999968,{"$error":"#VALUE!"},{"$error":"#VALUE!"},null,null,null,null,null,null,null,null,null,null,null,null,null,null,null,null,{"$f":"'Input Screen'!$C$8*5280*$AU$4*'Input Screen'!$C$9*2*(T140-$T$6)/12*0.0575","v":{"$error":"#DIV/0!"}},{"$error":"#DIV/0!"},{"$f":"AS140/($AU$4*'Input Screen'!$C$8)","v":{"$error":"#DIV/0!"}},{"$error":"#DIV/0!"},{"$error":"#DIV/0!"},{"$f":"AS140*'Input Screen'!$C$21/1000000","v":{"$error":"#DIV/0!"}}]
[null,null,null,null,null,null,null,null,null,null,null,null,null,null,null,null,null,null,null,{"$error":"#DIV/0!"},{"$f":"'Input Screen'!$C$8*5280*'Input Screen'!$C$9*2*(T141-$T$6)/12*0.0575","v":{"$error":"#DIV/0!"}},{"$f":"U141/'Input Screen'!$C$8","v":{"$error":"#DIV/0!"}},{"$error":"#DIV/0!"},{"$error":"#DIV/0!"},{"$f":"U141*'Input Screen'!$C$21/1000000","v":{"$error":"#DIV/0!"}},13.599999999999968,{"$error":"#VALUE!"},{"$error":"#VALUE!"},null,null,null,null,null,null,null,null,null,null,null,null,null,null,null,null,{"$f":"'Input Screen'!$C$8*5280*$AU$4*'Input Screen'!$C$9*2*(T141-$T$6)/12*0.0575","v":{"$error":"#DIV/0!"}},{"$error":"#DIV/0!"},{"$f":"AS141/($AU$4*'Input Screen'!$C$8)","v":{"$error":"#DIV/0!"}},{"$error":"#DIV/0!"},{"$error":"#DIV/0!"},{"$f":"AS141*'Input Screen'!$C$21/1000000","v":{"$error":"#DIV/0!"}}]
[null,null,null,null,null,null,null,null,null,null,null,null,null,null,null,null,null,null,null,{"$error":"#DIV/0!"},{"$f":"'Input Screen'!$C$8*5280*'Input Screen'!$C$9*2*(T142-$T$6)/12*0.0575","v":{"$error":"#DIV/0!"}},{"$f":"U142/'Input Screen'!$C$8","v":{"$error":"#DIV/0!"}},{"$error":"#DIV/0!"},{"$error":"#DIV/0!"},{"$f":"U142*'Input Screen'!$C$21/1000000","v":{"$error":"#DIV/0!"}},13.699999999999967,{"$error":"#VALUE!"},{"$error":"#VALUE!"},null,null,null,null,null,null,null,null,null,null,null,null,null,null,null,null,{"$f":"'Input Screen'!$C$8*5280*$AU$4*'Input Screen'!$C$9*2*(T142-$T$6)/12*0.0575","v":{"$error":"#DIV/0!"}},{"$error":"#DIV/0!"},{"$f":"AS142/($AU$4*'Input Screen'!$C$8)","v":{"$error":"#DIV/0!"}},{"$error":"#DIV/0!"},{"$error":"#DIV/0!"},{"$f":"AS142*'Input Screen'!$C$21/1000000","v":{"$error":"#DIV/0!"}}]
[null,null,null,null,null,null,null,null,null,null,null,null,null,null,null,null,null,null,null,{"$error":"#DIV/0!"},{"$f":"'Input Screen'!$C$8*5280*'Input Screen'!$C$9*2*(T143-$T$6)/12*0.0575","v":{"$error":"#DIV/0!"}},{"$f":"U143/'Input Screen'!$C$8","v":{"$error":"#DIV/0!"}},{"$error":"#DIV/0!"},{"$error":"#DIV/0!"},{"$f":"U143*'Input Screen'!$C$21/1000000","v":{"$error":"#DIV/0!"}},13.799999999999967,{"$error":"#VALUE!"},{"$error":"#VALUE!"},null,null,null,null,null,null,null,null,null,null,null,null,null,null,null,null,{"$f":"'Input Screen'!$C$8*5280*$AU$4*'Input Screen'!$C$9*2*(T143-$T$6)/12*0.0575","v":{"$error":"#DIV/0!"}},{"$error":"#DIV/0!"},{"$f":"AS143/($AU$4*'Input Screen'!$C$8)","v":{"$error":"#DIV/0!"}},{"$error":"#DIV/0!"},{"$error":"#DIV/0!"},{"$f":"AS143*'Input Screen'!$C$21/1000000","v":{"$error":"#DIV/0!"}}]
[null,null,null,null,null,null,null,null,null,null,null,null,null,null,null,null,null,null,null,{"$error":"#DIV/0!"},{"$f":"'Input Screen'!$C$8*5280*'Input Screen'!$C$9*2*(T144-$T$6)/12*0.0575","v":{"$error":"#DIV/0!"}},{"$f":"U144/'Input Screen'!$C$8","v":{"$error":"#DIV/0!"}},{"$error":"#DIV/0!"},{"$error":"#DIV/0!"},{"$f":"U144*'Input Screen'!$C$21/1000000","v":{"$error":"#DIV/0!"}},13.899999999999967,{"$error":"#VALUE!"},{"$error":"#VALUE!"},null,null,null,null,null,null,null,null,null,null,null,null,null,null,null,null,{"$f":"'Input Screen'!$C$8*5280*$AU$4*'Input Screen'!$C$9*2*(T144-$T$6)/12*0.0575","v":{"$error":"#DIV/0!"}},{"$error":"#DIV/0!"},{"$f":"AS144/($AU$4*'Input Screen'!$C$8)","v":{"$error":"#DIV/0!"}},{"$error":"#DIV/0!"},{"$error":"#DIV/0!"},{"$f":"AS144*'Input Screen'!$C$21/1000000","v":{"$error":"#DIV/0!"}}]
[null,null,null,null,null,null,null,null,null,null,null,null,null,null,null,null,null,null,null,{"$error":"#DIV/0!"},{"$f":"'Input Screen'!$C$8*5280*'Input Screen'!$C$9*2*(T145-$T$6)/12*0.0575","v":{"$error":"#DIV/0!"}},{"$f":"U145/'Input Screen'!$C$8","v":{"$error":"#DIV/0!"}},{"$error":"#DIV/0!"},{"$error":"#DIV/0!"},{"$f":"U145*'Input Screen'!$C$21/1000000","v":{"$error":"#DIV/0!"}},13.999999999999966,{"$error":"#VALUE!"},{"$error":"#VALUE!"},null,null,null,null,null,null,null,null,null,null,null,null,null,null,null,null,{"$f":"'Input Screen'!$C$8*5280*$AU$4*'Input Screen'!$C$9*2*(T145-$T$6)/12*0.0575","v":{"$error":"#DIV/0!"}},{"$error":"#DIV/0!"},{"$f":"AS145/($AU$4*'Input Screen'!$C$8)","v":{"$error":"#DIV/0!"}},{"$error":"#DIV/0!"},{"$error":"#DIV/0!"},{"$f":"AS145*'Input Screen'!$C$21/1000000","v":{"$error":"#DIV/0!"}}]
[null,null,null,null,null,null,null,null,null,null,null,null,null,null,null,null,null,null,null,{"$error":"#DIV/0!"},{"$f":"'Input Screen'!$C$8*5280*'Input Screen'!$C$9*2*(T146-$T$6)/12*0.0575","v":{"$error":"#DIV/0!"}},{"$f":"U146/'Input Screen'!$C$8","v":{"$error":"#DIV/0!"}},{"$error":"#DIV/0!"},{"$error":"#DIV/0!"},{"$f":"U146*'Input Screen'!$C$21/1000000","v":{"$error":"#DIV/0!"}},14.099999999999966,{"$error":"#VALUE!"},{"$error":"#VALUE!"},null,null,null,null,null,null,null,null,null,null,null,null,null,null,null,null,{"$f":"'Input Screen'!$C$8*5280*$AU$4*'Input Screen'!$C$9*2*(T146-$T$6)/12*0.0575","v":{"$error":"#DIV/0!"}},{"$error":"#DIV/0!"},{"$f":"AS146/($AU$4*'Input Screen'!$C$8)","v":{"$error":"#DIV/0!"}},{"$error":"#DIV/0!"},{"$error":"#DIV/0!"},{"$f":"AS146*'Input Screen'!$C$21/1000000","v":{"$error":"#DIV/0!"}}]
[null,null,null,null,null,null,null,null,null,null,null,null,null,null,null,null,null,null,null,{"$error":"#DIV/0!"},{"$f":"'Input Screen'!$C$8*5280*'Input Screen'!$C$9*2*(T147-$T$6)/12*0.0575","v":{"$error":"#DIV/0!"}},{"$f":"U147/'Input Screen'!$C$8","v":{"$error":"#DIV/0!"}},{"$error":"#DIV/0!"},{"$error":"#DIV/0!"},{"$f":"U147*'Input Screen'!$C$21/1000000","v":{"$error":"#DIV/0!"}},14.199999999999966,{"$error":"#VALUE!"},{"$error":"#VALUE!"},null,null,null,null,null,null,null,null,null,null,null,null,null,null,null,null,{"$f":"'Input Screen'!$C$8*5280*$AU$4*'Input Screen'!$C$9*2*(T147-$T$6)/12*0.0575","v":{"$error":"#DIV/0!"}},{"$error":"#DIV/0!"},{"$f":"AS147/($AU$4*'Input Screen'!$C$8)","v":{"$error":"#DIV/0!"}},{"$error":"#DIV/0!"},{"$error":"#DIV/0!"},{"$f":"AS147*'Input Screen'!$C$21/1000000","v":{"$error":"#DIV/0!"}}]
[null,null,null,null,null,null,null,null,null,null,null,null,null,null,null,null,null,null,null,{"$error":"#DIV/0!"},{"$f":"'Input Screen'!$C$8*5280*'Input Screen'!$C$9*2*(T148-$T$6)/12*0.0575","v":{"$error":"#DIV/0!"}},{"$f":"U148/'Input Screen'!$C$8","v":{"$error":"#DIV/0!"}},{"$error":"#DIV/0!"},{"$error":"#DIV/0!"},{"$f":"U148*'Input Screen'!$C$21/1000000","v":{"$error":"#DIV/0!"}},14.299999999999965,{"$error":"#VALUE!"},{"$error":"#VALUE!"},null,null,null,null,null,null,null,null,null,null,null,null,null,null,null,null,{"$f":"'Input Screen'!$C$8*5280*$AU$4*'Input Screen'!$C$9*2*(T148-$T$6)/12*0.0575","v":{"$error":"#DIV/0!"}},{"$error":"#DIV/0!"},{"$f":"AS148/($AU$4*'Input Screen'!$C$8)","v":{"$error":"#DIV/0!"}},{"$error":"#DIV/0!"},{"$error":"#DIV/0!"},{"$f":"AS148*'Input Screen'!$C$21/1000000","v":{"$error":"#DIV/0!"}}]
[null,null,null,null,null,null,null,null,null,null,null,null,null,null,null,null,null,null,null,{"$error":"#DIV/0!"},{"$f":"'Input Screen'!$C$8*5280*'Input Screen'!$C$9*2*(T149-$T$6)/12*0.0575","v":{"$error":"#DIV/0!"}},{"$f":"U149/'Input Screen'!$C$8","v":{"$error":"#DIV/0!"}},{"$error":"#DIV/0!"},{"$error":"#DIV/0!"},{"$f":"U149*'Input Screen'!$C$21/1000000","v":{"$error":"#DIV/0!"}},14.399999999999965,{"$error":"#VALUE!"},{"$error":"#VALUE!"},null,null,null,null,null,null,null,null,null,null,null,null,null,null,null,null,{"$f":"'Input Screen'!$C$8*5280*$AU$4*'Input Screen'!$C$9*2*(T149-$T$6)/12*0.0575","v":{"$error":"#DIV/0!"}},{"$error":"#DIV/0!"},{"$f":"AS149/($AU$4*'Input Screen'!$C$8)","v":{"$error":"#DIV/0!"}},{"$error":"#DIV/0!"},{"$error":"#DIV/0!"},{"$f":"AS149*'Input Screen'!$C$21/1000000","v":{"$error":"#DIV/0!"}}]
[null,null,null,null,null,null,null,null,null,null,null,null,null,null,null,null,null,null,null,{"$error":"#DIV/0!"},{"$f":"'Input Screen'!$C$8*5280*'Input Screen'!$C$9*2*(T150-$T$6)/12*0.0575","v":{"$error":"#DIV/0!"}},{"$f":"U150/'Input Screen'!$C$8","v":{"$error":"#DIV/0!"}},{"$error":"#DIV/0!"},{"$error":"#DIV/0!"},{"$f":"U150*'Input Screen'!$C$21/1000000","v":{"$error":"#DIV/0!"}},14.499999999999964,{"$error":"#VALUE!"},{"$error":"#VALUE!"},null,null,null,null,null,null,null,null,null,null,null,null,null,null,null,null,{"$f":"'Input Screen'!$C$8*5280*$AU$4*'Input Screen'!$C$9*2*(T150-$T$6)/12*0.0575","v":{"$error":"#DIV/0!"}},{"$error":"#DIV/0!"},{"$f":"AS150/($AU$4*'Input Screen'!$C$8)","v":{"$error":"#DIV/0!"}},{"$error":"#DIV/0!"},{"$error":"#DIV/0!"},{"$f":"AS150*'Input Screen'!$C$21/1000000","v":{"$error":"#DIV/0!"}}]
[null,null,null,null,null,null,null,null,null,null,null,null,null,null,null,null,null,null,null,{"$error":"#DIV/0!"},{"$f":"'Input Screen'!$C$8*5280*'Input Screen'!$C$9*2*(T151-$T$6)/12*0.0575","v":{"$error":"#DIV/0!"}},{"$f":"U151/'Input Screen'!$C$8","v":{"$error":"#DIV/0!"}},{"$error":"#DIV/0!"},{"$error":"#DIV/0!"},{"$f":"U151*'Input Screen'!$C$21/1000000","v":{"$error":"#DIV/0!"}},14.599999999999964,{"$error":"#VALUE!"},{"$error":"#VALUE!"},null,null,null,null,null,null,null,null,null,null,null,null,null,null,null,null,{"$f":"'Input Screen'!$C$8*5280*$AU$4*'Input Screen'!$C$9*2*(T151-$T$6)/12*0.0575","v":{"$error":"#DIV/0!"}},{"$error":"#DIV/0!"},{"$f":"AS151/($AU$4*'Input Screen'!$C$8)","v":{"$error":"#DIV/0!"}},{"$error":"#DIV/0!"},{"$error":"#DIV/0!"},{"$f":"AS151*'Input Screen'!$C$21/1000000","v":{"$error":"#DIV/0!"}}]
[null,null,null,null,null,null,null,null,null,null,null,null,null,null,null,null,null,null,null,{"$error":"#DIV/0!"},{"$f":"'Input Screen'!$C$8*5280*'Input Screen'!$C$9*2*(T152-$T$6)/12*0.0575","v":{"$error":"#DIV/0!"}},{"$f":"U152/'Input Screen'!$C$8","v":{"$error":"#DIV/0!"}},{"$error":"#DIV/0!"},{"$error":"#DIV/0!"},{"$f":"U152*'Input Screen'!$C$21/1000000","v":{"$error":"#DIV/0!"}},14.699999999999964,{"$error":"#VALUE!"},{"$error":"#VALUE!"},null,null,null,null,null,null,null,null,null,null,null,null,null,null,null,null,{"$f":"'Input Screen'!$C$8*5280*$AU$4*'Input Screen'!$C$9*2*(T152-$T$6)/12*0.0575","v":{"$error":"#DIV/0!"}},{"$error":"#DIV/0!"},{"$f":"AS152/($AU$4*'Input Screen'!$C$8)","v":{"$error":"#DIV/0!"}},{"$error":"#DIV/0!"},{"$error":"#DIV/0!"},{"$f":"AS152*'Input Screen'!$C$21/1000000","v":{"$error":"#DIV/0!"}}]
[null,null,null,null,null,null,null,null,null,null,null,null,null,null,null,null,null,null,null,{"$error":"#DIV/0!"},{"$f":"'Input Screen'!$C$8*5280*'Input Screen'!$C$9*2*(T153-$T$6)/12*0.0575","v":{"$error":"#DIV/0!"}},{"$f":"U153/'Input Screen'!$C$8","v":{"$error":"#DIV/0!"}},{"$error":"#DIV/0!"},{"$error":"#DIV/0!"},{"$f":"U153*'Input Screen'!$C$21/1000000","v":{"$error":"#DIV/0!"}},14.799999999999963,{"$error":"#VALUE!"},{"$error":"#VALUE!"},null,null,null,null,null,null,null,null,null,null,null,null,null,null,null,null,{"$f":"'Input Screen'!$C$8*5280*$AU$4*'Input Screen'!$C$9*2*(T153-$T$6)/12*0.0575","v":{"$error":"#DIV/0!"}},{"$error":"#DIV/0!"},{"$f":"AS153/($AU$4*'Input Screen'!$C$8)","v":{"$error":"#DIV/0!"}},{"$error":"#DIV/0!"},{"$error":"#DIV/0!"},{"$f":"AS153*'Input Screen'!$C$21/1000000","v":{"$error":"#DIV/0!"}}]
[null,null,null,null,null,null,null,null,null,null,null,null,null,null,null,null,null,null,null,{"$error":"#DIV/0!"},{"$f":"'Input Screen'!$C$8*5280*'Input Screen'!$C$9*2*(T154-$T$6)/12*0.0575","v":{"$error":"#DIV/0!"}},{"$f":"U154/'Input Screen'!$C$8","v":{"$error":"#DIV/0!"}},{"$error":"#DIV/0!"},{"$error":"#DIV/0!"},{"$f":"U154*'Input Screen'!$C$21/1000000","v":{"$error":"#DIV/0!"}},14.899999999999963,{"$error":"#VALUE!"},{"$error":"#VALUE!"},null,null,null,null,null,null,null,null,null,null,null,null,null,null,null,null,{"$f":"'Input Screen'!$C$8*5280*$AU$4*'Input Screen'!$C$9*2*(T154-$T$6)/12*0.0575","v":{"$error":"#DIV/0!"}},{"$error":"#DIV/0!"},{"$f":"AS154/($AU$4*'Input Screen'!$C$8)","v":{"$error":"#DIV/0!"}},{"$error":"#DIV/0!"},{"$error":"#DIV/0!"},{"$f":"AS154*'Input Screen'!$C$21/1000000","v":{"$error":"#DIV/0!"}}]
[null,null,null,null,null,null,null,null,null,null,null,null,null,null,null,null,null,null,null,{"$error":"#DIV/0!"},{"$f":"'Input Screen'!$C$8*5280*'Input Screen'!$C$9*2*(T155-$T$6)/12*0.0575","v":{"$error":"#DIV/0!"}},{"$f":"U155/'Input Screen'!$C$8","v":{"$error":"#DIV/0!"}},{"$error":"#DIV/0!"},{"$error":"#DIV/0!"},{"$f":"U155*'Input Screen'!$C$21/1000000","v":{"$error":"#DIV/0!"}},14.999999999999963,{"$error":"#VALUE!"},{"$error":"#VALUE!"},null,null,null,null,null,null,null,null,null,null,null,null,null,null,null,null,{"$f":"'Input Screen'!$C$8*5280*$AU$4*'Input Screen'!$C$9*2*(T155-$T$6)/12*0.0575","v":{"$error":"#DIV/0!"}},{"$error":"#DIV/0!"},{"$f":"AS155/($AU$4*'Input Screen'!$C$8)","v":{"$error":"#DIV/0!"}},{"$error":"#DIV/0!"},{"$error":"#DIV/0!"},{"$f":"AS155*'Input Screen'!$C$21/1000000","v":{"$error":"#DIV/0!"}}]
[null,null,null,null,null,null,null,null,null,null,null,null,null,null,null,null,null,null,null,{"$error":"#DIV/0!"},{"$f":"'Input Screen'!$C$8*5280*'Input Screen'!$C$9*2*(T156-$T$6)/12*0.0575","v":{"$error":"#DIV/0!"}},{"$f":"U156/'Input Screen'!$C$8","v":{"$error":"#DIV/0!"}},{"$error":"#DIV/0!"},{"$error":"#DIV/0!"},{"$f":"U156*'Input Screen'!$C$21/1000000","v":{"$error":"#DIV/0!"}},15.099999999999962,{"$error":"#VALUE!"},{"$error":"#VALUE!"},null,null,null,null,null,null,null,null,null,null,null,null,null,null,null,null,{"$f":"'Input Screen'!$C$8*5280*$AU$4*'Input Screen'!$C$9*2*(T156-$T$6)/12*0.0575","v":{"$error":"#DIV/0!"}},{"$error":"#DIV/0!"},{"$f":"AS156/($AU$4*'Input Screen'!$C$8)","v":{"$error":"#DIV/0!"}},{"$error":"#DIV/0!"},{"$error":"#DIV/0!"},{"$f":"AS156*'Input Screen'!$C$21/1000000","v":{"$error":"#DIV/0!"}}]
[null,null,null,null,null,null,null,null,null,null,null,null,null,null,null,null,null,null,null,{"$error":"#DIV/0!"},{"$f":"'Input Screen'!$C$8*5280*'Input Screen'!$C$9*2*(T157-$T$6)/12*0.0575","v":{"$error":"#DIV/0!"}},{"$f":"U157/'Input Screen'!$C$8","v":{"$error":"#DIV/0!"}},{"$error":"#DIV/0!"},{"$error":"#DIV/0!"},{"$f":"U157*'Input Screen'!$C$21/1000000","v":{"$error":"#DIV/0!"}},15.199999999999962,{"$error":"#VALUE!"},{"$error":"#VALUE!"},null,null,null,null,null,null,null,null,null,null,null,null,null,null,null,null,{"$f":"'Input Screen'!$C$8*5280*$AU$4*'Input Screen'!$C$9*2*(T157-$T$6)/12*0.0575","v":{"$error":"#DIV/0!"}},{"$error":"#DIV/0!"},{"$f":"AS157/($AU$4*'Input Screen'!$C$8)","v":{"$error":"#DIV/0!"}},{"$error":"#DIV/0!"},{"$error":"#DIV/0!"},{"$f":"AS157*'Input Screen'!$C$21/1000000","v":{"$error":"#DIV/0!"}}]
[null,null,null,null,null,null,null,null,null,null,null,null,null,null,null,null,null,null,null,{"$error":"#DIV/0!"},{"$f":"'Input Screen'!$C$8*5280*'Input Screen'!$C$9*2*(T158-$T$6)/12*0.0575","v":{"$error":"#DIV/0!"}},{"$f":"U158/'Input Screen'!$C$8","v":{"$error":"#DIV/0!"}},{"$error":"#DIV/0!"},{"$error":"#DIV/0!"},{"$f":"U158*'Input Screen'!$C$21/1000000","v":{"$error":"#DIV/0!"}},15.299999999999962,{"$error":"#VALUE!"},{"$error":"#VALUE!"},null,null,null,null,null,null,null,null,null,null,null,null,null,null,null,null,{"$f":"'Input Screen'!$C$8*5280*$AU$4*'Input Screen'!$C$9*2*(T158-$T$6)/12*0.0575","v":{"$error":"#DIV/0!"}},{"$error":"#DIV/0!"},{"$f":"AS158/($AU$4*'Input Screen'!$C$8)","v":{"$error":"#DIV/0!"}},{"$error":"#DIV/0!"},{"$error":"#DIV/0!"},{"$f":"AS158*'Input Screen'!$C$21/1000000","v":{"$error":"#DIV/0!"}}]
[null,null,null,null,null,null,null,null,null,null,null,null,null,null,null,null,null,null,null,{"$error":"#DIV/0!"},{"$f":"'Input Screen'!$C$8*5280*'Input Screen'!$C$9*2*(T159-$T$6)/12*0.0575","v":{"$error":"#DIV/0!"}},{"$f":"U159/'Input Screen'!$C$8","v":{"$error":"#DIV/0!"}},{"$error":"#DIV/0!"},{"$error":"#DIV/0!"},{"$f":"U159*'Input Screen'!$C$21/1000000","v":{"$error":"#DIV/0!"}},15.399999999999961,{"$error":"#VALUE!"},{"$error":"#VALUE!"},null,null,null,null,null,null,null,null,null,null,null,null,null,null,null,null,{"$f":"'Input Screen'!$C$8*5280*$AU$4*'Input Screen'!$C$9*2*(T159-$T$6)/12*0.0575","v":{"$error":"#DIV/0!"}},{"$error":"#DIV/0!"},{"$f":"AS159/($AU$4*'Input Screen'!$C$8)","v":{"$error":"#DIV/0!"}},{"$error":"#DIV/0!"},{"$error":"#DIV/0!"},{"$f":"AS159*'Input Screen'!$C$21/1000000","v":{"$error":"#DIV/0!"}}]
[null,null,null,null,null,null,null,null,null,null,null,null,null,null,null,null,null,null,null,{"$error":"#DIV/0!"},{"$f":"'Input Screen'!$C$8*5280*'Input Screen'!$C$9*2*(T160-$T$6)/12*0.0575","v":{"$error":"#DIV/0!"}},{"$f":"U160/'Input Screen'!$C$8","v":{"$error":"#DIV/0!"}},{"$error":"#DIV/0!"},{"$error":"#DIV/0!"},{"$f":"U160*'Input Screen'!$C$21/1000000","v":{"$error":"#DIV/0!"}},15.499999999999961,{"$error":"#VALUE!"},{"$error":"#VALUE!"},null,null,null,null,null,null,null,null,null,null,null,null,null,null,null,null,{"$f":"'Input Screen'!$C$8*5280*$AU$4*'Input Screen'!$C$9*2*(T160-$T$6)/12*0.0575","v":{"$error":"#DIV/0!"}},{"$error":"#DIV/0!"},{"$f":"AS160/($AU$4*'Input Screen'!$C$8)","v":{"$error":"#DIV/0!"}},{"$error":"#DIV/0!"},{"$error":"#DIV/0!"},{"$f":"AS160*'Input Screen'!$C$21/1000000","v":{"$error":"#DIV/0!"}}]
[null,null,null,null,null,null,null,null,null,null,null,null,null,null,null,null,null,null,null,{"$error":"#DIV/0!"},{"$f":"'Input Screen'!$C$8*5280*'Input Screen'!$C$9*2*(T161-$T$6)/12*0.0575","v":{"$error":"#DIV/0!"}},{"$f":"U161/'Input Screen'!$C$8","v":{"$error":"#DIV/0!"}},{"$error":"#DIV/0!"},{"$error":"#DIV/0!"},{"$f":"U161*'Input Screen'!$C$21/1000000","v":{"$error":"#DIV/0!"}},15.599999999999961,{"$error":"#VALUE!"},{"$error":"#VALUE!"},null,null,null,null,null,null,null,null,null,null,null,null,null,null,null,null,{"$f":"'Input Screen'!$C$8*5280*$AU$4*'Input Screen'!$C$9*2*(T161-$T$6)/12*0.0575","v":{"$error":"#DIV/0!"}},{"$error":"#DIV/0!"},{"$f":"AS161/($AU$4*'Input Screen'!$C$8)","v":{"$error":"#DIV/0!"}},{"$error":"#DIV/0!"},{"$error":"#DIV/0!"},{"$f":"AS161*'Input Screen'!$C$21/1000000","v":{"$error":"#DIV/0!"}}]
[null,null,null,null,null,null,null,null,null,null,null,null,null,null,null,null,null,null,null,{"$error":"#DIV/0!"},{"$f":"'Input Screen'!$C$8*5280*'Input Screen'!$C$9*2*(T162-$T$6)/12*0.0575","v":{"$error":"#DIV/0!"}},{"$f":"U162/'Input Screen'!$C$8","v":{"$error":"#DIV/0!"}},{"$error":"#DIV/0!"},{"$error":"#DIV/0!"},{"$f":"U162*'Input Screen'!$C$21/1000000","v":{"$error":"#DIV/0!"}},15.69999999999996,{"$error":"#VALUE!"},{"$error":"#VALUE!"},null,null,null,null,null,null,null,null,null,null,null,null,null,null,null,null,{"$f":"'Input Screen'!$C$8*5280*$AU$4*'Input Screen'!$C$9*2*(T162-$T$6)/12*0.0575","v":{"$error":"#DIV/0!"}},{"$error":"#DIV/0!"},{"$f":"AS162/($AU$4*'Input Screen'!$C$8)","v":{"$error":"#DIV/0!"}},{"$error":"#DIV/0!"},{"$error":"#DIV/0!"},{"$f":"AS162*'Input Screen'!$C$21/1000000","v":{"$error":"#DIV/0!"}}]
[null,null,null,null,null,null,null,null,null,null,null,null,null,null,null,null,null,null,null,{"$error":"#DIV/0!"},{"$f":"'Input Screen'!$C$8*5280*'Input Screen'!$C$9*2*(T163-$T$6)/12*0.0575","v":{"$error":"#DIV/0!"}},{"$f":"U163/'Input Screen'!$C$8","v":{"$error":"#DIV/0!"}},{"$error":"#DIV/0!"},{"$error":"#DIV/0!"},{"$f":"U163*'Input Screen'!$C$21/1000000","v":{"$error":"#DIV/0!"}},15.79999999999996,{"$error":"#VALUE!"},{"$error":"#VALUE!"},null,null,null,null,null,null,null,null,null,null,null,null,null,null,null,null,{"$f":"'Input Screen'!$C$8*5280*$AU$4*'Input Screen'!$C$9*2*(T163-$T$6)/12*0.0575","v":{"$error":"#DIV/0!"}},{"$error":"#DIV/0!"},{"$f":"AS163/($AU$4*'Input Screen'!$C$8)","v":{"$error":"#DIV/0!"}},{"$error":"#DIV/0!"},{"$error":"#DIV/0!"},{"$f":"AS163*'Input Screen'!$C$21/1000000","v":{"$error":"#DIV/0!"}}]
[null,null,null,null,null,null,null,null,null,null,null,null,null,null,null,null,null,null,null,{"$error":"#DIV/0!"},{"$f":"'Input Screen'!$C$8*5280*'Input Screen'!$C$9*2*(T164-$T$6)/12*0.0575","v":{"$error":"#DIV/0!"}},{"$f":"U164/'Input Screen'!$C$8","v":{"$error":"#DIV/0!"}},{"$error":"#DIV/0!"},{"$error":"#DIV/0!"},{"$f":"U164*'Input Screen'!$C$21/1000000","v":{"$error":"#DIV/0!"}},15.899999999999959,{"$error":"#VALUE!"},{"$error":"#VALUE!"},null,null,null,null,null,null,null,null,null,null,null,null,null,null,null,null,{"$f":"'Input Screen'!$C$8*5280*$AU$4*'Input Screen'!$C$9*2*(T164-$T$6)/12*0.0575","v":{"$error":"#DIV/0!"}},{"$error":"#DIV/0!"},{"$f":"AS164/($AU$4*'Input Screen'!$C$8)","v":{"$error":"#DIV/0!"}},{"$error":"#DIV/0!"},{"$error":"#DIV/0!"},{"$f":"AS164*'Input Screen'!$C$21/1000000","v":{"$error":"#DIV/0!"}}]
[null,null,null,null,null,null,null,null,null,null,null,null,null,null,null,null,null,null,null,{"$error":"#DIV/0!"},{"$f":"'Input Screen'!$C$8*5280*'Input Screen'!$C$9*2*(T165-$T$6)/12*0.0575","v":{"$error":"#DIV/0!"}},{"$f":"U165/'Input Screen'!$C$8","v":{"$error":"#DIV/0!"}},{"$error":"#DIV/0!"},{"$error":"#DIV/0!"},{"$f":"U165*'Input Screen'!$C$21/1000000","v":{"$error":"#DIV/0!"}},15.999999999999959,{"$error":"#VALUE!"},{"$error":"#VALUE!"},null,null,null,null,null,null,null,null,null,null,null,null,null,null,null,null,{"$f":"'Input Screen'!$C$8*5280*$AU$4*'Input Screen'!$C$9*2*(T165-$T$6)/12*0.0575","v":{"$error":"#DIV/0!"}},{"$error":"#DIV/0!"},{"$f":"AS165/($AU$4*'Input Screen'!$C$8)","v":{"$error":"#DIV/0!"}},{"$error":"#DIV/0!"},{"$error":"#DIV/0!"},{"$f":"AS165*'Input Screen'!$C$21/1000000","v":{"$error":"#DIV/0!"}}]
[null,null,null,null,null,null,null,null,null,null,null,null,null,null,null,null,null,null,null,{"$error":"#DIV/0!"},{"$f":"'Input Screen'!$C$8*5280*'Input Screen'!$C$9*2*(T166-$T$6)/12*0.0575","v":{"$error":"#DIV/0!"}},{"$f":"U166/'Input Screen'!$C$8","v":{"$error":"#DIV/0!"}},{"$error":"#DIV/0!"},{"$error":"#DIV/0!"},{"$f":"U166*'Input Screen'!$C$21/1000000","v":{"$error":"#DIV/0!"}},16.099999999999959,{"$error":"#VALUE!"},{"$error":"#VALUE!"},null,null,null,null,null,null,null,null,null,null,null,null,null,null,null,null,{"$f":"'Input Screen'!$C$8*5280*$AU$4*'Input Screen'!$C$9*2*(T166-$T$6)/12*0.0575","v":{"$error":"#DIV/0!"}},{"$error":"#DIV/0!"},{"$f":"AS166/($AU$4*'Input Screen'!$C$8)","v":{"$error":"#DIV/0!"}},{"$error":"#DIV/0!"},{"$error":"#DIV/0!"},{"$f":"AS166*'Input Screen'!$C$21/1000000","v":{"$error":"#DIV/0!"}}]
[null,null,null,null,null,null,null,null,null,null,null,null,null,null,null,null,null,null,null,{"$error":"#DIV/0!"},{"$f":"'Input Screen'!$C$8*5280*'Input Screen'!$C$9*2*(T167-$T$6)/12*0.0575","v":{"$error":"#DIV/0!"}},{"$f":"U167/'Input Screen'!$C$8","v":{"$error":"#DIV/0!"}},{"$error":"#DIV/0!"},{"$error":"#DIV/0!"},{"$f":"U167*'Input Screen'!$C$21/1000000","v":{"$error":"#DIV/0!"}},16.19999999999996,{"$error":"#VALUE!"},{"$error":"#VALUE!"},null,null,null,null,null,null,null,null,null,null,null,null,null,null,null,null,{"$f":"'Input Screen'!$C$8*5280*$AU$4*'Input Screen'!$C$9*2*(T167-$T$6)/12*0.0575","v":{"$error":"#DIV/0!"}},{"$error":"#DIV/0!"},{"$f":"AS167/($AU$4*'Input Screen'!$C$8)","v":{"$error":"#DIV/0!"}},{"$error":"#DIV/0!"},{"$error":"#DIV/0!"},{"$f":"AS167*'Input Screen'!$C$21/1000000","v":{"$error":"#DIV/0!"}}]
[null,null,null,null,null,null,null,null,null,null,null,null,null,null,null,null,null,null,null,{"$error":"#DIV/0!"},{"$f":"'Input Screen'!$C$8*5280*'Input Screen'!$C$9*2*(T168-$T$6)/12*0.0575","v":{"$error":"#DIV/0!"}},{"$f":"U168/'Input Screen'!$C$8","v":{"$error":"#DIV/0!"}},{"$error":"#DIV/0!"},{"$error":"#DIV/0!"},{"$f":"U168*'Input Screen'!$C$21/1000000","v":{"$error":"#DIV/0!"}},16.299999999999962,{"$error":"#VALUE!"},{"$error":"#VALUE!"},null,null,null,null,null,null,null,null,null,null,null,null,null,null,null,null,{"$f":"'Input Screen'!$C$8*5280*$AU$4*'Input Screen'!$C$9*2*(T168-$T$6)/12*0.0575","v":{"$error":"#DIV/0!"}},{"$error":"#DIV/0!"},{"$f":"AS168/($AU$4*'Input Screen'!$C$8)","v":{"$error":"#DIV/0!"}},{"$error":"#DIV/0!"},{"$error":"#DIV/0!"},{"$f":"AS168*'Input Screen'!$C$21/1000000","v":{"$error":"#DIV/0!"}}]
[null,null,null,null,null,null,null,null,null,null,null,null,null,null,null,null,null,null,null,{"$error":"#DIV/0!"},{"$f":"'Input Screen'!$C$8*5280*'Input Screen'!$C$9*2*(T169-$T$6)/12*0.0575","v":{"$error":"#DIV/0!"}},{"$f":"U169/'Input Screen'!$C$8","v":{"$error":"#DIV/0!"}},{"$error":"#DIV/0!"},{"$error":"#DIV/0!"},{"$f":"U169*'Input Screen'!$C$21/1000000","v":{"$error":"#DIV/0!"}},16.399999999999963,{"$error":"#VALUE!"},{"$error":"#VALUE!"},null,null,null,null,null,null,null,null,null,null,null,null,null,null,null,null,{"$f":"'Input Screen'!$C$8*5280*$AU$4*'Input Screen'!$C$9*2*(T169-$T$6)/12*0.0575","v":{"$error":"#DIV/0!"}},{"$error":"#DIV/0!"},{"$f":"AS169/($AU$4*'Input Screen'!$C$8)","v":{"$error":"#DIV/0!"}},{"$error":"#DIV/0!"},{"$error":"#DIV/0!"},{"$f":"AS169*'Input Screen'!$C$21/1000000","v":{"$error":"#DIV/0!"}}]
[null,null,null,null,null,null,null,null,null,null,null,null,null,null,null,null,null,null,null,{"$error":"#DIV/0!"},{"$f":"'Input Screen'!$C$8*5280*'Input Screen'!$C$9*2*(T170-$T$6)/12*0.0575","v":{"$error":"#DIV/0!"}},{"$f":"U170/'Input Screen'!$C$8","v":{"$error":"#DIV/0!"}},{"$error":"#DIV/0!"},{"$error":"#DIV/0!"},{"$f":"U170*'Input Screen'!$C$21/1000000","v":{"$error":"#DIV/0!"}},16.499999999999964,{"$error":"#VALUE!"},{"$error":"#VALUE!"},null,null,null,null,null,null,null,null,null,null,null,null,null,null,null,null,{"$f":"'Input Screen'!$C$8*5280*$AU$4*'Input Screen'!$C$9*2*(T170-$T$6)/12*0.0575","v":{"$error":"#DIV/0!"}},{"$error":"#DIV/0!"},{"$f":"AS170/($AU$4*'Input Screen'!$C$8)","v":{"$error":"#DIV/0!"}},{"$error":"#DIV/0!"},{"$error":"#DIV/0!"},{"$f":"AS170*'Input Screen'!$C$21/1000000","v":{"$error":"#DIV/0!"}}]
[null,null,null,null,null,null,null,null,null,null,null,null,null,null,null,null,null,null,null,{"$error":"#DIV/0!"},{"$f":"'Input Screen'!$C$8*5280*'Input Screen'!$C$9*2*(T171-$T$6)/12*0.0575","v":{"$error":"#DIV/0!"}},{"$f":"U171/'Input Screen'!$C$8","v":{"$error":"#DIV/0!"}},{"$error":"#DIV/0!"},{"$error":"#DIV/0!"},{"$f":"U171*'Input Screen'!$C$21/1000000","v":{"$error":"#DIV/0!"}},16.599999999999966,{"$error":"#VALUE!"},{"$error":"#VALUE!"},null,null,null,null,null,null,null,null,null,null,null,null,null,null,null,null,{"$f":"'Input Screen'!$C$8*5280*$AU$4*'Input Screen'!$C$9*2*(T171-$T$6)/12*0.0575","v":{"$error":"#DIV/0!"}},{"$error":"#DIV/0!"},{"$f":"AS171/($AU$4*'Input Screen'!$C$8)","v":{"$error":"#DIV/0!"}},{"$error":"#DIV/0!"},{"$error":"#DIV/0!"},{"$f":"AS171*'Input Screen'!$C$21/1000000","v":{"$error":"#DIV/0!"}}]
[null,null,null,null,null,null,null,null,null,null,null,null,null,null,null,null,null,null,null,{"$error":"#DIV/0!"},{"$f":"'Input Screen'!$C$8*5280*'Input Screen'!$C$9*2*(T172-$T$6)/12*0.0575","v":{"$error":"#DIV/0!"}},{"$f":"U172/'Input Screen'!$C$8","v":{"$error":"#DIV/0!"}},{"$error":"#DIV/0!"},{"$error":"#DIV/0!"},{"$f":"U172*'Input Screen'!$C$21/1000000","v":{"$error":"#DIV/0!"}},16.699999999999967,{"$error":"#VALUE!"},{"$error":"#VALUE!"},null,null,null,null,null,null,null,null,null,null,null,null,null,null,null,null,{"$f":"'Input Screen'!$C$8*5280*$AU$4*'Input Screen'!$C$9*2*(T172-$T$6)/12*0.0575","v":{"$error":"#DIV/0!"}},{"$error":"#DIV/0!"},{"$f":"AS172/($AU$4*'Input Screen'!$C$8)","v":{"$error":"#DIV/0!"}},{"$error":"#DIV/0!"},{"$error":"#DIV/0!"},{"$f":"AS172*'Input Screen'!$C$21/1000000","v":{"$error":"#DIV/0!"}}]
[null,null,null,null,null,null,null,null,null,null,null,null,null,null,null,null,null,null,null,{"$error":"#DIV/0!"},{"$f":"'Input Screen'!$C$8*5280*'Input Screen'!$C$9*2*(T173-$T$6)/12*0.0575","v":{"$error":"#DIV/0!"}},{"$f":"U173/'Input Screen'!$C$8","v":{"$error":"#DIV/0!"}},{"$error":"#DIV/0!"},{"$error":"#DIV/0!"},{"$f":"U173*'Input Screen'!$C$21/1000000","v":{"$error":"#DIV/0!"}},16.799999999999969,{"$error":"#VALUE!"},{"$error":"#VALUE!"},null,null,null,null,null,null,null,null,null,null,null,null,null,null,null,null,{"$f":"'Input Screen'!$C$8*5280*$AU$4*'Input Screen'!$C$9*2*(T173-$T$6)/12*0.0575","v":{"$error":"#DIV/0!"}},{"$error":"#DIV/0!"},{"$f":"AS173/($AU$4*'Input Screen'!$C$8)","v":{"$error":"#DIV/0!"}},{"$error":"#DIV/0!"},{"$error":"#DIV/0!"},{"$f":"AS173*'Input Screen'!$C$21/1000000","v":{"$error":"#DIV/0!"}}]
[null,null,null,null,null,null,null,null,null,null,null,null,null,null,null,null,null,null,null,{"$error":"#DIV/0!"},{"$f":"'Input Screen'!$C$8*5280*'Input Screen'!$C$9*2*(T174-$T$6)/12*0.0575","v":{"$error":"#DIV/0!"}},{"$f":"U174/'Input Screen'!$C$8","v":{"$error":"#DIV/0!"}},{"$error":"#DIV/0!"},{"$error":"#DIV/0!"},{"$f":"U174*'Input Screen'!$C$21/1000000","v":{"$error":"#DIV/0!"}},16.89999999999997,{"$error":"#VALUE!"},{"$error":"#VALUE!"},null,null,null,null,null,null,null,null,null,null,null,null,null,null,null,null,{"$f":"'Input Screen'!$C$8*5280*$AU$4*'Input Screen'!$C$9*2*(T174-$T$6)/12*0.0575","v":{"$error":"#DIV/0!"}},{"$error":"#DIV/0!"},{"$f":"AS174/($AU$4*'Input Screen'!$C$8)","v":{"$error":"#DIV/0!"}},{"$error":"#DIV/0!"},{"$error":"#DIV/0!"},{"$f":"AS174*'Input Screen'!$C$21/1000000","v":{"$error":"#DIV/0!"}}]
[null,null,null,null,null,null,null,null,null,null,null,null,null,null,null,null,null,null,null,{"$error":"#DIV/0!"},{"$f":"'Input Screen'!$C$8*5280*'Input Screen'!$C$9*2*(T175-$T$6)/12*0.0575","v":{"$error":"#DIV/0!"}},{"$f":"U175/'Input Screen'!$C$8","v":{"$error":"#DIV/0!"}},{"$error":"#DIV/0!"},{"$error":"#DIV/0!"},{"$f":"U175*'Input Screen'!$C$21/1000000","v":{"$error":"#DIV/0!"}},16.999999999999972,{"$error":"#VALUE!"},{"$error":"#VALUE!"},null,null,null,null,null,null,null,null,null,null,null,null,null,null,null,null,{"$f":"'Input Screen'!$C$8*5280*$AU$4*'Input Screen'!$C$9*2*(T175-$T$6)/12*0.0575","v":{"$error":"#DIV/0!"}},{"$error":"#DIV/0!"},{"$f":"AS175/($AU$4*'Input Screen'!$C$8)","v":{"$error":"#DIV/0!"}},{"$error":"#DIV/0!"},{"$error":"#DIV/0!"},{"$f":"AS175*'Input Screen'!$C$21/1000000","v":{"$error":"#DIV/0!"}}]
[null,null,null,null,null,null,null,null,null,null,null,null,null,null,null,null,null,null,null,{"$error":"#DIV/0!"},{"$f":"'Input Screen'!$C$8*5280*'Input Screen'!$C$9*2*(T176-$T$6)/12*0.0575","v":{"$error":"#DIV/0!"}},{"$f":"U176/'Input Screen'!$C$8","v":{"$error":"#DIV/0!"}},{"$error":"#DIV/0!"},{"$error":"#DIV/0!"},{"$f":"U176*'Input Screen'!$C$21/1000000","v":{"$error":"#DIV/0!"}},17.099999999999973,{"$error":"#VALUE!"},{"$error":"#VALUE!"},null,null,null,null,null,null,null,null,null,null,null,null,null,null,null,null,{"$f":"'Input Screen'!$C$8*5280*$AU$4*'Input Screen'!$C$9*2*(T176-$T$6)/12*0.0575","v":{"$error":"#DIV/0!"}},{"$error":"#DIV/0!"},{"$f":"AS176/($AU$4*'Input Screen'!$C$8)","v":{"$error":"#DIV/0!"}},{"$error":"#DIV/0!"},{"$error":"#DIV/0!"},{"$f":"AS176*'Input Screen'!$C$21/1000000","v":{"$error":"#DIV/0!"}}]
[null,null,null,null,null,null,null,null,null,null,null,null,null,null,null,null,null,null,null,{"$error":"#DIV/0!"},{"$f":"'Input Screen'!$C$8*5280*'Input Screen'!$C$9*2*(T177-$T$6)/12*0.0575","v":{"$error":"#DIV/0!"}},{"$f":"U177/'Input Screen'!$C$8","v":{"$error":"#DIV/0!"}},{"$error":"#DIV/0!"},{"$error":"#DIV/0!"},{"$f":"U177*'Input Screen'!$C$21/1000000","v":{"$error":"#DIV/0!"}},17.199999999999974,{"$error":"#VALUE!"},{"$error":"#VALUE!"},null,null,null,null,null,null,null,null,null,null,null,null,null,null,null,null,{"$f":"'Input Screen'!$C$8*5280*$AU$4*'Input Screen'!$C$9*2*(T177-$T$6)/12*0.0575","v":{"$error":"#DIV/0!"}},{"$error":"#DIV/0!"},{"$f":"AS177/($AU$4*'Input Screen'!$C$8)","v":{"$error":"#DIV/0!"}},{"$error":"#DIV/0!"},{"$error":"#DIV/0!"},{"$f":"AS177*'Input Screen'!$C$21/1000000","v":{"$error":"#DIV/0!"}}]
[null,null,null,null,null,null,null,null,null,null,null,null,null,null,null,null,null,null,null,{"$error":"#DIV/0!"},{"$f":"'Input Screen'!$C$8*5280*'Input Screen'!$C$9*2*(T178-$T$6)/12*0.0575","v":{"$error":"#DIV/0!"}},{"$f":"U178/'Input Screen'!$C$8","v":{"$error":"#DIV/0!"}},{"$error":"#DIV/0!"},{"$error":"#DIV/0!"},{"$f":"U178*'Input Screen'!$C$21/1000000","v":{"$error":"#DIV/0!"}},17.299999999999976,{"$error":"#VALUE!"},{"$error":"#VALUE!"},null,null,null,null,null,null,null,null,null,null,null,null,null,null,null,null,{"$f":"'Input Screen'!$C$8*5280*$AU$4*'Input Screen'!$C$9*2*(T178-$T$6)/12*0.0575","v":{"$error":"#DIV/0!"}},{"$error":"#DIV/0!"},{"$f":"AS178/($AU$4*'Input Screen'!$C$8)","v":{"$error":"#DIV/0!"}},{"$error":"#DIV/0!"},{"$error":"#DIV/0!"},{"$f":"AS178*'Input Screen'!$C$21/1000000","v":{"$error":"#DIV/0!"}}]
[null,null,null,null,null,null,null,null,null,null,null,null,null,null,null,null,null,null,null,{"$error":"#DIV/0!"},{"$f":"'Input Screen'!$C$8*5280*'Input Screen'!$C$9*2*(T179-$T$6)/12*0.0575","v":{"$error":"#DIV/0!"}},{"$f":"U179/'Input Screen'!$C$8","v":{"$error":"#DIV/0!"}},{"$error":"#DIV/0!"},{"$error":"#DIV/0!"},{"$f":"U179*'Input Screen'!$C$21/1000000","v":{"$error":"#DIV/0!"}},17.399999999999977,{"$error":"#VALUE!"},{"$error":"#VALUE!"},null,null,null,null,null,null,null,null,null,null,null,null,null,null,null,null,{"$f":"'Input Screen'!$C$8*5280*$AU$4*'Input Screen'!$C$9*2*(T179-$T$6)/12*0.0575","v":{"$error":"#DIV/0!"}},{"$error":"#DIV/0!"},{"$f":"AS179/($AU$4*'Input Screen'!$C$8)","v":{"$error":"#DIV/0!"}},{"$error":"#DIV/0!"},{"$error":"#DIV/0!"},{"$f":"AS179*'Input Screen'!$C$21/1000000","v":{"$error":"#DIV/0!"}}]
[null,null,null,null,null,null,null,null,null,null,null,null,null,null,null,null,null,null,null,{"$error":"#DIV/0!"},{"$f":"'Input Screen'!$C$8*5280*'Input Screen'!$C$9*2*(T180-$T$6)/12*0.0575","v":{"$error":"#DIV/0!"}},{"$f":"U180/'Input Screen'!$C$8","v":{"$error":"#DIV/0!"}},{"$error":"#DIV/0!"},{"$error":"#DIV/0!"},{"$f":"U180*'Input Screen'!$C$21/1000000","v":{"$error":"#DIV/0!"}},17.499999999999979,{"$error":"#VALUE!"},{"$error":"#VALUE!"},null,null,null,null,null,null,null,null,null,null,null,null,null,null,null,null,{"$f":"'Input Screen'!$C$8*5280*$AU$4*'Input Screen'!$C$9*2*(T180-$T$6)/12*0.0575","v":{"$error":"#DIV/0!"}},{"$error":"#DIV/0!"},{"$f":"AS180/($AU$4*'Input Screen'!$C$8)","v":{"$error":"#DIV/0!"}},{"$error":"#DIV/0!"},{"$error":"#DIV/0!"},{"$f":"AS180*'Input Screen'!$C$21/1000000","v":{"$error":"#DIV/0!"}}]
[null,null,null,null,null,null,null,null,null,null,null,null,null,null,null,null,null,null,null,{"$error":"#DIV/0!"},{"$f":"'Input Screen'!$C$8*5280*'Input Screen'!$C$9*2*(T181-$T$6)/12*0.0575","v":{"$error":"#DIV/0!"}},{"$f":"U181/'Input Screen'!$C$8","v":{"$error":"#DIV/0!"}},{"$error":"#DIV/0!"},{"$error":"#DIV/0!"},{"$f":"U181*'Input Screen'!$C$21/1000000","v":{"$error":"#DIV/0!"}},17.59999999999998,{"$error":"#VALUE!"},{"$error":"#VALUE!"},null,null,null,null,null,null,null,null,null,null,null,null,null,null,null,null,{"$f":"'Input Screen'!$C$8*5280*$AU$4*'Input Screen'!$C$9*2*(T181-$T$6)/12*0.0575","v":{"$error":"#DIV/0!"}},{"$error":"#DIV/0!"},{"$f":"AS181/($AU$4*'Input Screen'!$C$8)","v":{"$error":"#DIV/0!"}},{"$error":"#DIV/0!"},{"$error":"#DIV/0!"},{"$f":"AS181*'Input Screen'!$C$21/1000000","v":{"$error":"#DIV/0!"}}]
[null,null,null,null,null,null,null,null,null,null,null,null,null,null,null,null,null,null,null,{"$error":"#DIV/0!"},{"$f":"'Input Screen'!$C$8*5280*'Input Screen'!$C$9*2*(T182-$T$6)/12*0.0575","v":{"$error":"#DIV/0!"}},{"$f":"U182/'Input Screen'!$C$8","v":{"$error":"#DIV/0!"}},{"$error":"#DIV/0!"},{"$error":"#DIV/0!"},{"$f":"U182*'Input Screen'!$C$21/1000000","v":{"$error":"#DIV/0!"}},17.699999999999982,{"$error":"#VALUE!"},{"$error":"#VALUE!"},null,null,null,null,null,null,null,null,null,null,null,null,null,null,null,null,{"$f":"'Input Screen'!$C$8*5280*$AU$4*'Input Screen'!$C$9*2*(T182-$T$6)/12*0.0575","v":{"$error":"#DIV/0!"}},{"$error":"#DIV/0!"},{"$f":"AS182/($AU$4*'Input Screen'!$C$8)","v":{"$error":"#DIV/0!"}},{"$error":"#DIV/0!"},{"$error":"#DIV/0!"},{"$f":"AS182*'Input Screen'!$C$21/1000000","v":{"$error":"#DIV/0!"}}]
[null,null,null,null,null,null,null,null,null,null,null,null,null,null,null,null,null,null,null,{"$error":"#DIV/0!"},{"$f":"'Input Screen'!$C$8*5280*'Input Screen'!$C$9*2*(T183-$T$6)/12*0.0575","v":{"$error":"#DIV/0!"}},{"$f":"U183/'Input Screen'!$C$8","v":{"$error":"#DIV/0!"}},{"$error":"#DIV/0!"},{"$error":"#DIV/0!"},{"$f":"U183*'Input Screen'!$C$21/1000000","v":{"$error":"#DIV/0!"}},17.799999999999983,{"$error":"#VALUE!"},{"$error":"#VALUE!"},null,null,null,null,null,null,null,null,null,null,null,null,null,null,null,null,{"$f":"'Input Screen'!$C$8*5280*$AU$4*'Input Screen'!$C$9*2*(T183-$T$6)/12*0.0575","v":{"$error":"#DIV/0!"}},{"$error":"#DIV/0!"},{"$f":"AS183/($AU$4*'Input Screen'!$C$8)","v":{"$error":"#DIV/0!"}},{"$error":"#DIV/0!"},{"$error":"#DIV/0!"},{"$f":"AS183*'Input Screen'!$C$21/1000000","v":{"$error":"#DIV/0!"}}]
[null,null,null,null,null,null,null,null,null,null,null,null,null,null,null,null,null,null,null,{"$error":"#DIV/0!"},{"$f":"'Input Screen'!$C$8*5280*'Input Screen'!$C$9*2*(T184-$T$6)/12*0.0575","v":{"$error":"#DIV/0!"}},{"$f":"U184/'Input Screen'!$C$8","v":{"$error":"#DIV/0!"}},{"$error":"#DIV/0!"},{"$error":"#DIV/0!"},{"$f":"U184*'Input Screen'!$C$21/1000000","v":{"$error":"#DIV/0!"}},17.899999999999984,{"$error":"#VALUE!"},{"$error":"#VALUE!"},null,null,null,null,null,null,null,null,null,null,null,null,null,null,null,null,{"$f":"'Input Screen'!$C$8*5280*$AU$4*'Input Screen'!$C$9*2*(T184-$T$6)/12*0.0575","v":{"$error":"#DIV/0!"}},{"$error":"#DIV/0!"},{"$f":"AS184/($AU$4*'Input Screen'!$C$8)","v":{"$error":"#DIV/0!"}},{"$error":"#DIV/0!"},{"$error":"#DIV/0!"},{"$f":"AS184*'Input Screen'!$C$21/1000000","v":{"$error":"#DIV/0!"}}]
[null,null,null,null,null,null,null,null,null,null,null,null,null,null,null,null,null,null,null,{"$error":"#DIV/0!"},{"$f":"'Input Screen'!$C$8*5280*'Input Screen'!$C$9*2*(T185-$T$6)/12*0.0575","v":{"$error":"#DIV/0!"}},{"$f":"U185/'Input Screen'!$C$8","v":{"$error":"#DIV/0!"}},{"$error":"#DIV/0!"},{"$error":"#DIV/0!"},{"$f":"U185*'Input Screen'!$C$21/1000000","v":{"$error":"#DIV/0!"}},17.999999999999986,{"$error":"#VALUE!"},{"$error":"#VALUE!"},null,null,null,null,null,null,null,null,null,null,null,null,null,null,null,null,{"$f":"'Input Screen'!$C$8*5280*$AU$4*'Input Screen'!$C$9*2*(T185-$T$6)/12*0.0575","v":{"$error":"#DIV/0!"}},{"$error":"#DIV/0!"},{"$f":"AS185/($AU$4*'Input Screen'!$C$8)","v":{"$error":"#DIV/0!"}},{"$error":"#DIV/0!"},{"$error":"#DIV/0!"},{"$f":"AS185*'Input Screen'!$C$21/1000000","v":{"$error":"#DIV/0!"}}]
[null,null,null,null,null,null,null,null,null,null,null,null,null,null,null,null,null,null,null,{"$error":"#DIV/0!"},{"$f":"'Input Screen'!$C$8*5280*'Input Screen'!$C$9*2*(T186-$T$6)/12*0.0575","v":{"$error":"#DIV/0!"}},{"$f":"U186/'Input Screen'!$C$8","v":{"$error":"#DIV/0!"}},{"$error":"#DIV/0!"},{"$error":"#DIV/0!"},{"$f":"U186*'Input Screen'!$C$21/1000000","v":{"$error":"#DIV/0!"}},18.099999999999987,{"$error":"#VALUE!"},{"$error":"#VALUE!"},null,null,null,null,null,null,null,null,null,null,null,null,null,null,null,null,{"$f":"'Input Screen'!$C$8*5280*$AU$4*'Input Screen'!$C$9*2*(T186-$T$6)/12*0.0575","v":{"$error":"#DIV/0!"}},{"$error":"#DIV/0!"},{"$f":"AS186/($AU$4*'Input Screen'!$C$8)","v":{"$error":"#DIV/0!"}},{"$error":"#DIV/0!"},{"$error":"#DIV/0!"},{"$f":"AS186*'Input Screen'!$C$21/1000000","v":{"$error":"#DIV/0!"}}]
[null,null,null,null,null,null,null,null,null,null,null,null,null,null,null,null,null,null,null,{"$error":"#DIV/0!"},{"$f":"'Input Screen'!$C$8*5280*'Input Screen'!$C$9*2*(T187-$T$6)/12*0.0575","v":{"$error":"#DIV/0!"}},{"$f":"U187/'Input Screen'!$C$8","v":{"$error":"#DIV/0!"}},{"$error":"#DIV/0!"},{"$error":"#DIV/0!"},{"$f":"U187*'Input Screen'!$C$21/1000000","v":{"$error":"#DIV/0!"}},18.199999999999989,{"$error":"#VALUE!"},{"$error":"#VALUE!"},null,null,null,null,null,null,null,null,null,null,null,null,null,null,null,null,{"$f":"'Input Screen'!$C$8*5280*$AU$4*'Input Screen'!$C$9*2*(T187-$T$6)/12*0.0575","v":{"$error":"#DIV/0!"}},{"$error":"#DIV/0!"},{"$f":"AS187/($AU$4*'Input Screen'!$C$8)","v":{"$error":"#DIV/0!"}},{"$error":"#DIV/0!"},{"$error":"#DIV/0!"},{"$f":"AS187*'Input Screen'!$C$21/1000000","v":{"$error":"#DIV/0!"}}]
[null,null,null,null,null,null,null,null,null,null,null,null,null,null,null,null,null,null,null,{"$error":"#DIV/0!"},{"$f":"'Input Screen'!$C$8*5280*'Input Screen'!$C$9*2*(T188-$T$6)/12*0.0575","v":{"$error":"#DIV/0!"}},{"$f":"U188/'Input Screen'!$C$8","v":{"$error":"#DIV/0!"}},{"$error":"#DIV/0!"},{"$error":"#DIV/0!"},{"$f":"U188*'Input Screen'!$C$21/1000000","v":{"$error":"#DIV/0!"}},18.29999999999999,{"$error":"#VALUE!"},{"$error":"#VALUE!"},null,null,null,null,null,null,null,null,null,null,null,null,null,null,null,null,{"$f":"'Input Screen'!$C$8*5280*$AU$4*'Input Screen'!$C$9*2*(T188-$T$6)/12*0.0575","v":{"$error":"#DIV/0!"}},{"$error":"#DIV/0!"},{"$f":"AS188/($AU$4*'Input Screen'!$C$8)","v":{"$error":"#DIV/0!"}},{"$error":"#DIV/0!"},{"$error":"#DIV/0!"},{"$f":"AS188*'Input Screen'!$C$21/1000000","v":{"$error":"#DIV/0!"}}]
[null,null,null,null,null,null,null,null,null,null,null,null,null,null,null,null,null,null,null,{"$error":"#DIV/0!"},{"$f":"'Input Screen'!$C$8*5280*'Input Screen'!$C$9*2*(T189-$T$6)/12*0.0575","v":{"$error":"#DIV/0!"}},{"$f":"U189/'Input Screen'!$C$8","v":{"$error":"#DIV/0!"}},{"$error":"#DIV/0!"},{"$error":"#DIV/0!"},{"$f":"U189*'Input Screen'!$C$21/1000000","v":{"$error":"#DIV/0!"}},18.399999999999991,{"$error":"#VALUE!"},{"$error":"#VALUE!"},null,null,null,null,null,null,null,null,null,null,null,null,null,null,null,null,{"$f":"'Input Screen'!$C$8*5280*$AU$4*'Input Screen'!$C$9*2*(T189-$T$6)/12*0.0575","v":{"$error":"#DIV/0!"}},{"$error":"#DIV/0!"},{"$f":"AS189/($AU$4*'Input Screen'!$C$8)","v":{"$error":"#DIV/0!"}},{"$error":"#DIV/0!"},{"$error":"#DIV/0!"},{"$f":"AS189*'Input Screen'!$C$21/1000000","v":{"$error":"#DIV/0!"}}]
[null,null,null,null,null,null,null,null,null,null,null,null,null,null,null,null,null,null,null,{"$error":"#DIV/0!"},{"$f":"'Input Screen'!$C$8*5280*'Input Screen'!$C$9*2*(T190-$T$6)/12*0.0575","v":{"$error":"#DIV/0!"}},{"$f":"U190/'Input Screen'!$C$8","v":{"$error":"#DIV/0!"}},{"$error":"#DIV/0!"},{"$error":"#DIV/0!"},{"$f":"U190*'Input Screen'!$C$21/1000000","v":{"$error":"#DIV/0!"}},18.499999999999993,{"$error":"#VALUE!"},{"$error":"#VALUE!"},null,null,null,null,null,null,null,null,null,null,null,null,null,null,null,null,{"$f":"'Input Screen'!$C$8*5280*$AU$4*'Input Screen'!$C$9*2*(T190-$T$6)/12*0.0575","v":{"$error":"#DIV/0!"}},{"$error":"#DIV/0!"},{"$f":"AS190/($AU$4*'Input Screen'!$C$8)","v":{"$error":"#DIV/0!"}},{"$error":"#DIV/0!"},{"$error":"#DIV/0!"},{"$f":"AS190*'Input Screen'!$C$21/1000000","v":{"$error":"#DIV/0!"}}]
[null,null,null,null,null,null,null,null,null,null,null,null,null,null,null,null,null,null,null,{"$error":"#DIV/0!"},{"$f":"'Input Screen'!$C$8*5280*'Input Screen'!$C$9*2*(T191-$T$6)/12*0.0575","v":{"$error":"#DIV/0!"}},{"$f":"U191/'Input Screen'!$C$8","v":{"$error":"#DIV/0!"}},{"$error":"#DIV/0!"},{"$error":"#DIV/0!"},{"$f":"U191*'Input Screen'!$C$21/1000000","v":{"$error":"#DIV/0!"}},18.599999999999994,{"$error":"#VALUE!"},{"$error":"#VALUE!"},null,null,null,null,null,null,null,null,null,null,null,null,null,null,null,null,{"$f":"'Input Screen'!$C$8*5280*$AU$4*'Input Screen'!$C$9*2*(T191-$T$6)/12*0.0575","v":{"$error":"#DIV/0!"}},{"$error":"#DIV/0!"},{"$f":"AS191/($AU$4*'Input Screen'!$C$8)","v":{"$error":"#DIV/0!"}},{"$error":"#DIV/0!"},{"$error":"#DIV/0!"},{"$f":"AS191*'Input Screen'!$C$21/1000000","v":{"$error":"#DIV/0!"}}]
[null,null,null,null,null,null,null,null,null,null,null,null,null,null,null,null,null,null,null,{"$error":"#DIV/0!"},{"$f":"'Input Screen'!$C$8*5280*'Input Screen'!$C$9*2*(T192-$T$6)/12*0.0575","v":{"$error":"#DIV/0!"}},{"$f":"U192/'Input Screen'!$C$8","v":{"$error":"#DIV/0!"}},{"$error":"#DIV/0!"},{"$error":"#DIV/0!"},{"$f":"U192*'Input Screen'!$C$21/1000000","v":{"$error":"#DIV/0!"}},18.699999999999996,{"$error":"#VALUE!"},{"$error":"#VALUE!"},null,null,null,null,null,null,null,null,null,null,null,null,null,null,null,null,{"$f":"'Input Screen'!$C$8*5280*$AU$4*'Input Screen'!$C$9*2*(T192-$T$6)/12*0.0575","v":{"$error":"#DIV/0!"}},{"$error":"#DIV/0!"},{"$f":"AS192/($AU$4*'Input Screen'!$C$8)","v":{"$error":"#DIV/0!"}},{"$error":"#DIV/0!"},{"$error":"#DIV/0!"},{"$f":"AS192*'Input Screen'!$C$21/1000000","v":{"$error":"#DIV/0!"}}]
[null,null,null,null,null,null,null,null,null,null,null,null,null,null,null,null,null,null,null,{"$error":"#DIV/0!"},{"$f":"'Input Screen'!$C$8*5280*'Input Screen'!$C$9*2*(T193-$T$6)/12*0.0575","v":{"$error":"#DIV/0!"}},{"$f":"U193/'Input Screen'!$C$8","v":{"$error":"#DIV/0!"}},{"$error":"#DIV/0!"},{"$error":"#DIV/0!"},{"$f":"U193*'Input Screen'!$C$21/1000000","v":{"$error":"#DIV/0!"}},18.799999999999997,{"$error":"#VALUE!"},{"$error":"#VALUE!"},null,null,null,null,null,null,null,null,null,null,null,null,null,null,null,null,{"$f":"'Input Screen'!$C$8*5280*$AU$4*'Input Screen'!$C$9*2*(T193-$T$6)/12*0.0575","v":{"$error":"#DIV/0!"}},{"$error":"#DIV/0!"},{"$f":"AS193/($AU$4*'Input Screen'!$C$8)","v":{"$error":"#DIV/0!"}},{"$error":"#DIV/0!"},{"$error":"#DIV/0!"},{"$f":"AS193*'Input Screen'!$C$21/1000000","v":{"$error":"#DIV/0!"}}]
[null,null,null,null,null,null,null,null,null,null,null,null,null,null,null,null,null,null,null,{"$error":"#DIV/0!"},{"$f":"'Input Screen'!$C$8*5280*'Input Screen'!$C$9*2*(T194-$T$6)/12*0.0575","v":{"$error":"#DIV/0!"}},{"$f":"U194/'Input Screen'!$C$8","v":{"$error":"#DIV/0!"}},{"$error":"#DIV/0!"},{"$error":"#DIV/0!"},{"$f":"U194*'Input Screen'!$C$21/1000000","v":{"$error":"#DIV/0!"}},18.899999999999999,{"$error":"#VALUE!"},{"$error":"#VALUE!"},null,null,null,null,null,null,null,null,null,null,null,null,null,null,null,null,{"$f":"'Input Screen'!$C$8*5280*$AU$4*'Input Screen'!$C$9*2*(T194-$T$6)/12*0.0575","v":{"$error":"#DIV/0!"}},{"$error":"#DIV/0!"},{"$f":"AS194/($AU$4*'Input Screen'!$C$8)","v":{"$error":"#DIV/0!"}},{"$error":"#DIV/0!"},{"$error":"#DIV/0!"},{"$f":"AS194*'Input Screen'!$C$21/1000000","v":{"$error":"#DIV/0!"}}]
[null,null,null,null,null,null,null,null,null,null,null,null,null,null,null,null,null,null,null,{"$error":"#DIV/0!"},{"$f":"'Input Screen'!$C$8*5280*'Input Screen'!$C$9*2*(T195-$T$6)/12*0.0575","v":{"$error":"#DIV/0!"}},{"$f":"U195/'Input Screen'!$C$8","v":{"$error":"#DIV/0!"}},{"$error":"#DIV/0!"},{"$error":"#DIV/0!"},{"$f":"U195*'Input Screen'!$C$21/1000000","v":{"$error":"#DIV/0!"}},19,{"$error":"#VALUE!"},{"$error":"#VALUE!"},null,null,null,null,null,null,null,null,null,null,null,null,null,null,null,null,{"$f":"'Input Screen'!$C$8*5280*$AU$4*'Input Screen'!$C$9*2*(T195-$T$6)/12*0.0575","v":{"$error":"#DIV/0!"}},{"$error":"#DIV/0!"},{"$f":"AS195/($AU$4*'Input Screen'!$C$8)","v":{"$error":"#DIV/0!"}},{"$error":"#DIV/0!"},{"$error":"#DIV/0!"},{"$f":"AS195*'Input Screen'!$C$21/1000000","v":{"$error":"#DIV/0!"}}]
[null,null,null,null,null,null,null,null,null,null,null,null,null,null,null,null,null,null,null,{"$error":"#DIV/0!"},{"$f":"'Input Screen'!$C$8*5280*'Input Screen'!$C$9*2*(T196-$T$6)/12*0.0575","v":{"$error":"#DIV/0!"}},{"$f":"U196/'Input Screen'!$C$8","v":{"$error":"#DIV/0!"}},{"$error":"#DIV/0!"},{"$error":"#DIV/0!"},{"$f":"U196*'Input Screen'!$C$21/1000000","v":{"$error":"#DIV/0!"}},19.100000000000001,{"$error":"#VALUE!"},{"$error":"#VALUE!"},null,null,null,null,null,null,null,null,null,null,null,null,null,null,null,null,{"$f":"'Input Screen'!$C$8*5280*$AU$4*'Input Screen'!$C$9*2*(T196-$T$6)/12*0.0575","v":{"$error":"#DIV/0!"}},{"$error":"#DIV/0!"},{"$f":"AS196/($AU$4*'Input Screen'!$C$8)","v":{"$error":"#DIV/0!"}},{"$error":"#DIV/0!"},{"$error":"#DIV/0!"},{"$f":"AS196*'Input Screen'!$C$21/1000000","v":{"$error":"#DIV/0!"}}]
[null,null,null,null,null,null,null,null,null,null,null,null,null,null,null,null,null,null,null,{"$error":"#DIV/0!"},{"$f":"'Input Screen'!$C$8*5280*'Input Screen'!$C$9*2*(T197-$T$6)/12*0.0575","v":{"$error":"#DIV/0!"}},{"$f":"U197/'Input Screen'!$C$8","v":{"$error":"#DIV/0!"}},{"$error":"#DIV/0!"},{"$error":"#DIV/0!"},{"$f":"U197*'Input Screen'!$C$21/1000000","v":{"$error":"#DIV/0!"}},19.200000000000003,{"$error":"#VALUE!"},{"$error":"#VALUE!"},null,null,null,null,null,null,null,null,null,null,null,null,null,null,null,null,{"$f":"'Input Screen'!$C$8*5280*$AU$4*'Input Screen'!$C$9*2*(T197-$T$6)/12*0.0575","v":{"$error":"#DIV/0!"}},{"$error":"#DIV/0!"},{"$f":"AS197/($AU$4*'Input Screen'!$C$8)","v":{"$error":"#DIV/0!"}},{"$error":"#DIV/0!"},{"$error":"#DIV/0!"},{"$f":"AS197*'Input Screen'!$C$21/1000000","v":{"$error":"#DIV/0!"}}]
[null,null,null,null,null,null,null,null,null,null,null,null,null,null,null,null,null,null,null,{"$error":"#DIV/0!"},{"$f":"'Input Screen'!$C$8*5280*'Input Screen'!$C$9*2*(T198-$T$6)/12*0.0575","v":{"$error":"#DIV/0!"}},{"$f":"U198/'Input Screen'!$C$8","v":{"$error":"#DIV/0!"}},{"$error":"#DIV/0!"},{"$error":"#DIV/0!"},{"$f":"U198*'Input Screen'!$C$21/1000000","v":{"$error":"#DIV/0!"}},19.300000000000004,{"$error":"#VALUE!"},{"$error":"#VALUE!"},null,null,null,null,null,null,null,null,null,null,null,null,null,null,null,null,{"$f":"'Input Screen'!$C$8*5280*$AU$4*'Input Screen'!$C$9*2*(T198-$T$6)/12*0.0575","v":{"$error":"#DIV/0!"}},{"$error":"#DIV/0!"},{"$f":"AS198/($AU$4*'Input Screen'!$C$8)","v":{"$error":"#DIV/0!"}},{"$error":"#DIV/0!"},{"$error":"#DIV/0!"},{"$f":"AS198*'Input Screen'!$C$21/1000000","v":{"$error":"#DIV/0!"}}]
[null,null,null,null,null,null,null,null,null,null,null,null,null,null,null,null,null,null,null,{"$error":"#DIV/0!"},{"$f":"'Input Screen'!$C$8*5280*'Input Screen'!$C$9*2*(T199-$T$6)/12*0.0575","v":{"$error":"#DIV/0!"}},{"$f":"U199/'Input Screen'!$C$8","v":{"$error":"#DIV/0!"}},{"$f":"1-(_xlfn.NORM.S.DIST((T199-$BA$6)/((MAX($T$6:$T$306)-$BA$6)/6),TRUE))","v":{"$error":"#DIV/0!"}},{"$f":"U199*$R$6/1000000","v":{"$error":"#DIV/0!"}},{"$f":"U199*'Input Screen'!$C$21/1000000","v":{"$error":"#DIV/0!"}},19.400000000000006,{"$f":"(_xlfn.WEIBULL.DIST(Z199,$M$6,$M$7,TRUE))","v":{"$error":"#VALUE!"}},{"$f":"1-AA199","v":{"$error":"#VALUE!"}},null,null,null,null,null,null,null,null,null,null,null,null,null,null,null,null,{"$f":"'Input Screen'!$C$8*5280*$AU$4*'Input Screen'!$C$9*2*(T199-$T$6)/12*0.0575","v":{"$error":"#DIV/0!"}},{"$error":"#DIV/0!"},{"$f":"AS199/($AU$4*'Input Screen'!$C$8)","v":{"$error":"#DIV/0!"}},{"$f":"1-(_xlfn.NORM.S.DIST((AT199-$BA$6)/((MAX($T$6:$T$306)-$BA$6)/6),TRUE))","v":{"$error":"#DIV/0!"}},{"$f":"AS199*$R$6/1000000","v":{"$error":"#DIV/0!"}},{"$f":"AS199*'Input Screen'!$C$21/1000000","v":{"$error":"#DIV/0!"}}]
[null,null,null,null,null,null,null,null,null,null,null,null,null,null,null,null,null,null,null,{"$f":"IF(T199>=5,5,T199+0.01)","v":{"$error":"#DIV/0!"}},{"$f":"'Input Screen'!$C$8*5280*'Input Screen'!$C$9*2*(T200-$T$6)/12*0.0575","v":{"$error":"#DIV/0!"}},{"$f":"U200/'Input Screen'!$C$8","v":{"$error":"#DIV/0!"}},{"$error":"#DIV/0!"},{"$error":"#DIV/0!"},{"$f":"U200*'Input Screen'!$C$21/1000000","v":{"$error":"#DIV/0!"}},{"$f":"Z199+0.1","v":19.500000000000007},{"$error":"#VALUE!"},{"$error":"#VALUE!"},null,null,null,null,null,null,null,null,null,null,null,null,null,null,null,null,{"$f":"'Input Screen'!$C$8*5280*$AU$4*'Input Screen'!$C$9*2*(T200-$T$6)/12*0.0575","v":{"$error":"#DIV/0!"}},{"$f":"IF(AT199>=5,5,AT199+0.01)","v":{"$error":"#DIV/0!"}},{"$f":"AS200/($AU$4*'Input Screen'!$C$8)","v":{"$error":"#DIV/0!"}},{"$error":"#DIV/0!"},{"$error":"#DIV/0!"},{"$f":"AS200*'Input Screen'!$C$21/1000000","v":{"$error":"#DIV/0!"}}]
[null,null,null,null,null,null,null,null,null,null,null,null,null,null,null,null,null,null,null,{"$error":"#DIV/0!"},{"$f":"'Input Screen'!$C$8*5280*'Input Screen'!$C$9*2*(T201-$T$6)/12*0.0575","v":{"$error":"#DIV/0!"}},{"$f":"U201/'Input Screen'!$C$8","v":{"$error":"#DIV/0!"}},{"$error":"#DIV/0!"},{"$error":"#DIV/0!"},{"$f":"U201*'Input Screen'!$C$21/1000000","v":{"$error":"#DIV/0!"}},19.600000000000009,{"$error":"#VALUE!"},{"$error":"#VALUE!"},null,null,null,null,null,null,null,null,null,null,null,null,null,null,null,null,{"$f":"'Input Screen'!$C$8*5280*$AU$4*'Input Screen'!$C$9*2*(T201-$T$6)/12*0.0575","v":{"$error":"#DIV/0!"}},{"$error":"#DIV/0!"},{"$f":"AS201/($AU$4*'Input Screen'!$C$8)","v":{"$error":"#DIV/0!"}},{"$error":"#DIV/0!"},{"$error":"#DIV/0!"},{"$f":"AS201*'Input Screen'!$C$21/1000000","v":{"$error":"#DIV/0!"}}]
[null,null,null,null,null,null,null,null,null,null,null,null,null,null,null,null,null,null,null,{"$error":"#DIV/0!"},{"$f":"'Input Screen'!$C$8*5280*'Input Screen'!$C$9*2*(T202-$T$6)/12*0.0575","v":{"$error":"#DIV/0!"}},{"$f":"U202/'Input Screen'!$C$8","v":{"$error":"#DIV/0!"}},{"$error":"#DIV/0!"},{"$error":"#DIV/0!"},{"$f":"U202*'Input Screen'!$C$21/1000000","v":{"$error":"#DIV/0!"}},19.70000000000001,{"$error":"#VALUE!"},{"$error":"#VALUE!"},null,null,null,null,null,null,null,null,null,null,null,null,null,null,null,null,{"$f":"'Input Screen'!$C$8*5280*$AU$4*'Input Screen'!$C$9*2*(T202-$T$6)/12*0.0575","v":{"$error":"#DIV/0!"}},{"$error":"#DIV/0!"},{"$f":"AS202/($AU$4*'Input Screen'!$C$8)","v":{"$error":"#DIV/0!"}},{"$error":"#DIV/0!"},{"$error":"#DIV/0!"},{"$f":"AS202*'Input Screen'!$C$21/1000000","v":{"$error":"#DIV/0!"}}]
[null,null,null,null,null,null,null,null,null,null,null,null,null,null,null,null,null,null,null,{"$error":"#DIV/0!"},{"$f":"'Input Screen'!$C$8*5280*'Input Screen'!$C$9*2*(T203-$T$6)/12*0.0575","v":{"$error":"#DIV/0!"}},{"$f":"U203/'Input Screen'!$C$8","v":{"$error":"#DIV/0!"}},{"$error":"#DIV/0!"},{"$error":"#DIV/0!"},{"$f":"U203*'Input Screen'!$C$21/1000000","v":{"$error":"#DIV/0!"}},19.800000000000011,{"$error":"#VALUE!"},{"$error":"#VALUE!"},null,null,null,null,null,null,null,null,null,null,null,null,null,null,null,null,{"$f":"'Input Screen'!$C$8*5280*$AU$4*'Input Screen'!$C$9*2*(T203-$T$6)/12*0.0575","v":{"$error":"#DIV/0!"}},{"$error":"#DIV/0!"},{"$f":"AS203/($AU$4*'Input Screen'!$C$8)","v":{"$error":"#DIV/0!"}},{"$error":"#DIV/0!"},{"$error":"#DIV/0!"},{"$f":"AS203*'Input Screen'!$C$21/1000000","v":{"$error":"#DIV/0!"}}]
[null,null,null,null,null,null,null,null,null,null,null,null,null,null,null,null,null,null,null,{"$error":"#DIV/0!"},{"$f":"'Input Screen'!$C$8*5280*'Input Screen'!$C$9*2*(T204-$T$6)/12*0.0575","v":{"$error":"#DIV/0!"}},{"$f":"U204/'Input Screen'!$C$8","v":{"$error":"#DIV/0!"}},{"$error":"#DIV/0!"},{"$error":"#DIV/0!"},{"$f":"U204*'Input Screen'!$C$21/1000000","v":{"$error":"#DIV/0!"}},19.900000000000013,{"$error":"#VALUE!"},{"$error":"#VALUE!"},null,null,null,null,null,null,null,null,null,null,null,null,null,null,null,null,{"$f":"'Input Screen'!$C$8*5280*$AU$4*'Input Screen'!$C$9*2*(T204-$T$6)/12*0.0575","v":{"$error":"#DIV/0!"}},{"$error":"#DIV/0!"},{"$f":"AS204/($AU$4*'Input Screen'!$C$8)","v":{"$error":"#DIV/0!"}},{"$error":"#DIV/0!"},{"$error":"#DIV/0!"},{"$f":"AS204*'Input Screen'!$C$21/1000000","v":{"$error":"#DIV/0!"}}]
[null,null,null,null,null,null,null,null,null,null,null,null,null,null,null,null,null,null,null,{"$error":"#DIV/0!"},{"$f":"'Input Screen'!$C$8*5280*'Input Screen'!$C$9*2*(T205-$T$6)/12*0.0575","v":{"$error":"#DIV/0!"}},{"$f":"U205/'Input Screen'!$C$8","v":{"$error":"#DIV/0!"}},{"$error":"#DIV/0!"},{"$error":"#DIV/0!"},{"$f":"U205*'Input Screen'!$C$21/1000000","v":{"$error":"#DIV/0!"}},20.000000000000014,{"$error":"#VALUE!"},{"$error":"#VALUE!"},null,null,null,null,null,null,null,null,null,null,null,null,null,null,null,null,{"$f":"'Input Screen'!$C$8*5280*$AU$4*'Input Screen'!$C$9*2*(T205-$T$6)/12*0.0575","v":{"$error":"#DIV/0!"}},{"$error":"#DIV/0!"},{"$f":"AS205/($AU$4*'Input Screen'!$C$8)","v":{"$error":"#DIV/0!"}},{"$error":"#DIV/0!"},{"$error":"#DIV/0!"},{"$f":"AS205*'Input Screen'!$C$21/1000000","v":{"$error":"#DIV/0!"}}]
[null,null,null,null,null,null,null,null,null,null,null,null,null,null,null,null,null,null,null,{"$error":"#DIV/0!"},{"$f":"'Input Screen'!$C$8*5280*'Input Screen'!$C$9*2*(T206-$T$6)/12*0.0575","v":{"$error":"#DIV/0!"}},{"$f":"U206/'Input Screen'!$C$8","v":{"$error":"#DIV/0!"}},{"$error":"#DIV/0!"},{"$error":"#DIV/0!"},{"$f":"U206*'Input Screen'!$C$21/1000000","v":{"$error":"#DIV/0!"}},20.100000000000016,{"$error":"#VALUE!"},{"$error":"#VALUE!"},null,null,null,null,null,null,null,null,null,null,null,null,null,null,null,null,{"$f":"'Input Screen'!$C$8*5280*$AU$4*'Input Screen'!$C$9*2*(T206-$T$6)/12*0.0575","v":{"$error":"#DIV/0!"}},{"$error":"#DIV/0!"},{"$f":"AS206/($AU$4*'Input Screen'!$C$8)","v":{"$error":"#DIV/0!"}},{"$error":"#DIV/0!"},{"$error":"#DIV/0!"},{"$f":"AS206*'Input Screen'!$C$21/1000000","v":{"$error":"#DIV/0!"}}]
[null,null,null,null,null,null,null,null,null,null,null,null,null,null,null,null,null,null,null,{"$error":"#DIV/0!"},{"$f":"'Input Screen'!$C$8*5280*'Input Screen'!$C$9*2*(T207-$T$6)/12*0.0575","v":{"$error":"#DIV/0!"}},{"$f":"U207/'Input Screen'!$C$8","v":{"$error":"#DIV/0!"}},{"$error":"#DIV/0!"},{"$error":"#DIV/0!"},{"$f":"U207*'Input Screen'!$C$21/1000000","v":{"$error":"#DIV/0!"}},20.200000000000017,{"$error":"#VALUE!"},{"$error":"#VALUE!"},null,null,null,null,null,null,null,null,null,null,null,null,null,null,null,null,{"$f":"'Input Screen'!$C$8*5280*$AU$4*'Input Screen'!$C$9*2*(T207-$T$6)/12*0.0575","v":{"$error":"#DIV/0!"}},{"$error":"#DIV/0!"},{"$f":"AS207/($AU$4*'Input Screen'!$C$8)","v":{"$error":"#DIV/0!"}},{"$error":"#DIV/0!"},{"$error":"#DIV/0!"},{"$f":"AS207*'Input Screen'!$C$21/1000000","v":{"$error":"#DIV/0!"}}]
[null,null,null,null,null,null,null,null,null,null,null,null,null,null,null,null,null,null,null,{"$error":"#DIV/0!"},{"$f":"'Input Screen'!$C$8*5280*'Input Screen'!$C$9*2*(T208-$T$6)/12*0.0575","v":{"$error":"#DIV/0!"}},{"$f":"U208/'Input Screen'!$C$8","v":{"$error":"#DIV/0!"}},{"$error":"#DIV/0!"},{"$error":"#DIV/0!"},{"$f":"U208*'Input Screen'!$C$21/1000000","v":{"$error":"#DIV/0!"}},20.300000000000018,{"$error":"#VALUE!"},{"$error":"#VALUE!"},null,null,null,null,null,null,null,null,null,null,null,null,null,null,null,null,{"$f":"'Input Screen'!$C$8*5280*$AU$4*'Input Screen'!$C$9*2*(T208-$T$6)/12*0.0575","v":{"$error":"#DIV/0!"}},{"$error":"#DIV/0!"},{"$f":"AS208/($AU$4*'Input Screen'!$C$8)","v":{"$error":"#DIV/0!"}},{"$error":"#DIV/0!"},{"$error":"#DIV/0!"},{"$f":"AS208*'Input Screen'!$C$21/1000000","v":{"$error":"#DIV/0!"}}]
[null,null,null,null,null,null,null,null,null,null,null,null,null,null,null,null,null,null,null,{"$error":"#DIV/0!"},{"$f":"'Input Screen'!$C$8*5280*'Input Screen'!$C$9*2*(T209-$T$6)/12*0.0575","v":{"$error":"#DIV/0!"}},{"$f":"U209/'Input Screen'!$C$8","v":{"$error":"#DIV/0!"}},{"$error":"#DIV/0!"},{"$error":"#DIV/0!"},{"$f":"U209*'Input Screen'!$C$21/1000000","v":{"$error":"#DIV/0!"}},20.40000000000002,{"$error":"#VALUE!"},{"$error":"#VALUE!"},null,null,null,null,null,null,null,null,null,null,null,null,null,null,null,null,{"$f":"'Input Screen'!$C$8*5280*$AU$4*'Input Screen'!$C$9*2*(T209-$T$6)/12*0.0575","v":{"$error":"#DIV/0!"}},{"$error":"#DIV/0!"},{"$f":"AS209/($AU$4*'Input Screen'!$C$8)","v":{"$error":"#DIV/0!"}},{"$error":"#DIV/0!"},{"$error":"#DIV/0!"},{"$f":"AS209*'Input Screen'!$C$21/1000000","v":{"$error":"#DIV/0!"}}]
[null,null,null,null,null,null,null,null,null,null,null,null,null,null,null,null,null,null,null,{"$error":"#DIV/0!"},{"$f":"'Input Screen'!$C$8*5280*'Input Screen'!$C$9*2*(T210-$T$6)/12*0.0575","v":{"$error":"#DIV/0!"}},{"$f":"U210/'Input Screen'!$C$8","v":{"$error":"#DIV/0!"}},{"$error":"#DIV/0!"},{"$error":"#DIV/0!"},{"$f":"U210*'Input Screen'!$C$21/1000000","v":{"$error":"#DIV/0!"}},20.500000000000021,{"$error":"#VALUE!"},{"$error":"#VALUE!"},null,null,null,null,null,null,null,null,null,null,null,null,null,null,null,null,{"$f":"'Input Screen'!$C$8*5280*$AU$4*'Input Screen'!$C$9*2*(T210-$T$6)/12*0.0575","v":{"$error":"#DIV/0!"}},{"$error":"#DIV/0!"},{"$f":"AS210/($AU$4*'Input Screen'!$C$8)","v":{"$error":"#DIV/0!"}},{"$error":"#DIV/0!"},{"$error":"#DIV/0!"},{"$f":"AS210*'Input Screen'!$C$21/1000000","v":{"$error":"#DIV/0!"}}]
[null,null,null,null,null,null,null,null,null,null,null,null,null,null,null,null,null,null,null,{"$error":"#DIV/0!"},{"$f":"'Input Screen'!$C$8*5280*'Input Screen'!$C$9*2*(T211-$T$6)/12*0.0575","v":{"$error":"#DIV/0!"}},{"$f":"U211/'Input Screen'!$C$8","v":{"$error":"#DIV/0!"}},{"$error":"#DIV/0!"},{"$error":"#DIV/0!"},{"$f":"U211*'Input Screen'!$C$21/1000000","v":{"$error":"#DIV/0!"}},20.600000000000023,{"$error":"#VALUE!"},{"$error":"#VALUE!"},null,null,null,null,null,null,null,null,null,null,null,null,null,null,null,null,{"$f":"'Input Screen'!$C$8*5280*$AU$4*'Input Screen'!$C$9*2*(T211-$T$6)/12*0.0575","v":{"$error":"#DIV/0!"}},{"$error":"#DIV/0!"},{"$f":"AS211/($AU$4*'Input Screen'!$C$8)","v":{"$error":"#DIV/0!"}},{"$error":"#DIV/0!"},{"$error":"#DIV/0!"},{"$f":"AS211*'Input Screen'!$C$21/1000000","v":{"$error":"#DIV/0!"}}]
[null,null,null,null,null,null,null,null,null,null,null,null,null,null,null,null,null,null,null,{"$error":"#DIV/0!"},{"$f":"'Input Screen'!$C$8*5280*'Input Screen'!$C$9*2*(T212-$T$6)/12*0.0575","v":{"$error":"#DIV/0!"}},{"$f":"U212/'Input Screen'!$C$8","v":{"$error":"#DIV/0!"}},{"$error":"#DIV/0!"},{"$error":"#DIV/0!"},{"$f":"U212*'Input Screen'!$C$21/1000000","v":{"$error":"#DIV/0!"}},20.700000000000024,{"$error":"#VALUE!"},{"$error":"#VALUE!"},null,null,null,null,null,null,null,null,null,null,null,null,null,null,null,null,{"$f":"'Input Screen'!$C$8*5280*$AU$4*'Input Screen'!$C$9*2*(T212-$T$6)/12*0.0575","v":{"$error":"#DIV/0!"}},{"$error":"#DIV/0!"},{"$f":"AS212/($AU$4*'Input Screen'!$C$8)","v":{"$error":"#DIV/0!"}},{"$error":"#DIV/0!"},{"$error":"#DIV/0!"},{"$f":"AS212*'Input Screen'!$C$21/1000000","v":{"$error":"#DIV/0!"}}]
[null,null,null,null,null,null,null,null,null,null,null,null,null,null,null,null,null,null,null,{"$error":"#DIV/0!"},{"$f":"'Input Screen'!$C$8*5280*'Input Screen'!$C$9*2*(T213-$T$6)/12*0.0575","v":{"$error":"#DIV/0!"}},{"$f":"U213/'Input Screen'!$C$8","v":{"$error":"#DIV/0!"}},{"$error":"#DIV/0!"},{"$error":"#DIV/0!"},{"$f":"U213*'Input Screen'!$C$21/1000000","v":{"$error":"#DIV/0!"}},20.800000000000026,{"$error":"#VALUE!"},{"$error":"#VALUE!"},null,null,null,null,null,null,null,null,null,null,null,null,null,null,null,null,{"$f":"'Input Screen'!$C$8*5280*$AU$4*'Input Screen'!$C$9*2*(T213-$T$6)/12*0.0575","v":{"$error":"#DIV/0!"}},{"$error":"#DIV/0!"},{"$f":"AS213/($AU$4*'Input Screen'!$C$8)","v":{"$error":"#DIV/0!"}},{"$error":"#DIV/0!"},{"$error":"#DIV/0!"},{"$f":"AS213*'Input Screen'!$C$21/1000000","v":{"$error":"#DIV/0!"}}]
[null,null,null,null,null,null,null,null,null,null,null,null,null,null,null,null,null,null,null,{"$error":"#DIV/0!"},{"$f":"'Input Screen'!$C$8*5280*'Input Screen'!$C$9*2*(T214-$T$6)/12*0.0575","v":{"$error":"#DIV/0!"}},{"$f":"U214/'Input Screen'!$C$8","v":{"$error":"#DIV/0!"}},{"$error":"#DIV/0!"},{"$error":"#DIV/0!"},{"$f":"U214*'Input Screen'!$C$21/1000000","v":{"$error":"#DIV/0!"}},20.900000000000027,{"$error":"#VALUE!"},{"$error":"#VALUE!"},null,null,null,null,null,null,null,null,null,null,null,null,null,null,null,null,{"$f":"'Input Screen'!$C$8*5280*$AU$4*'Input Screen'!$C$9*2*(T214-$T$6)/12*0.0575","v":{"$error":"#DIV/0!"}},{"$error":"#DIV/0!"},{"$f":"AS214/($AU$4*'Input Screen'!$C$8)","v":{"$error":"#DIV/0!"}},{"$error":"#DIV/0!"},{"$error":"#DIV/0!"},{"$f":"AS214*'Input Screen'!$C$21/1000000","v":{"$error":"#DIV/0!"}}]
[null,null,null,null,null,null,null,null,null,null,null,null,null,null,null,null,null,null,null,{"$error":"#DIV/0!"},{"$f":"'Input Screen'!$C$8*5280*'Input Screen'!$C$9*2*(T215-$T$6)/12*0.0575","v":{"$error":"#DIV/0!"}},{"$f":"U215/'Input Screen'!$C$8","v":{"$error":"#DIV/0!"}},{"$error":"#DIV/0!"},{"$error":"#DIV/0!"},{"$f":"U215*'Input Screen'!$C$21/1000000","v":{"$error":"#DIV/0!"}},21.000000000000028,{"$error":"#VALUE!"},{"$error":"#VALUE!"},null,null,null,null,null,null,null,null,null,null,null,null,null,null,null,null,{"$f":"'Input Screen'!$C$8*5280*$AU$4*'Input Screen'!$C$9*2*(T215-$T$6)/12*0.0575","v":{"$error":"#DIV/0!"}},{"$error":"#DIV/0!"},{"$f":"AS215/($AU$4*'Input Screen'!$C$8)","v":{"$error":"#DIV/0!"}},{"$error":"#DIV/0!"},{"$error":"#DIV/0!"},{"$f":"AS215*'Input Screen'!$C$21/1000000","v":{"$error":"#DIV/0!"}}]
[null,null,null,null,null,null,null,null,null,null,null,null,null,null,null,null,null,null,null,{"$error":"#DIV/0!"},{"$f":"'Input Screen'!$C$8*5280*'Input Screen'!$C$9*2*(T216-$T$6)/12*0.0575","v":{"$error":"#DIV/0!"}},{"$f":"U216/'Input Screen'!$C$8","v":{"$error":"#DIV/0!"}},{"$error":"#DIV/0!"},{"$error":"#DIV/0!"},{"$f":"U216*'Input Screen'!$C$21/1000000","v":{"$error":"#DIV/0!"}},21.10000000000003,{"$error":"#VALUE!"},{"$error":"#VALUE!"},null,null,null,null,null,null,null,null,null,null,null,null,null,null,null,null,{"$f":"'Input Screen'!$C$8*5280*$AU$4*'Input Screen'!$C$9*2*(T216-$T$6)/12*0.0575","v":{"$error":"#DIV/0!"}},{"$error":"#DIV/0!"},{"$f":"AS216/($AU$4*'Input Screen'!$C$8)","v":{"$error":"#DIV/0!"}},{"$error":"#DIV/0!"},{"$error":"#DIV/0!"},{"$f":"AS216*'Input Screen'!$C$21/1000000","v":{"$error":"#DIV/0!"}}]
[null,null,null,null,null,null,null,null,null,null,null,null,null,null,null,null,null,null,null,{"$error":"#DIV/0!"},{"$f":"'Input Screen'!$C$8*5280*'Input Screen'!$C$9*2*(T217-$T$6)/12*0.0575","v":{"$error":"#DIV/0!"}},{"$f":"U217/'Input Screen'!$C$8","v":{"$error":"#DIV/0!"}},{"$error":"#DIV/0!"},{"$error":"#DIV/0!"},{"$f":"U217*'Input Screen'!$C$21/1000000","v":{"$error":"#DIV/0!"}},21.200000000000031,{"$error":"#VALUE!"},{"$error":"#VALUE!"},null,null,null,null,null,null,null,null,null,null,null,null,null,null,null,null,{"$f":"'Input Screen'!$C$8*5280*$AU$4*'Input Screen'!$C$9*2*(T217-$T$6)/12*0.0575","v":{"$error":"#DIV/0!"}},{"$error":"#DIV/0!"},{"$f":"AS217/($AU$4*'Input Screen'!$C$8)","v":{"$error":"#DIV/0!"}},{"$error":"#DIV/0!"},{"$error":"#DIV/0!"},{"$f":"AS217*'Input Screen'!$C$21/1000000","v":{"$error":"#DIV/0!"}}]
[null,null,null,null,null,null,null,null,null,null,null,null,null,null,null,null,null,null,null,{"$error":"#DIV/0!"},{"$f":"'Input Screen'!$C$8*5280*'Input Screen'!$C$9*2*(T218-$T$6)/12*0.0575","v":{"$error":"#DIV/0!"}},{"$f":"U218/'Input Screen'!$C$8","v":{"$error":"#DIV/0!"}},{"$error":"#DIV/0!"},{"$error":"#DIV/0!"},{"$f":"U218*'Input Screen'!$C$21/1000000","v":{"$error":"#DIV/0!"}},21.300000000000033,{"$error":"#VALUE!"},{"$error":"#VALUE!"},null,null,null,null,null,null,null,null,null,null,null,null,null,null,null,null,{"$f":"'Input Screen'!$C$8*5280*$AU$4*'Input Screen'!$C$9*2*(T218-$T$6)/12*0.0575","v":{"$error":"#DIV/0!"}},{"$error":"#DIV/0!"},{"$f":"AS218/($AU$4*'Input Screen'!$C$8)","v":{"$error":"#DIV/0!"}},{"$error":"#DIV/0!"},{"$error":"#DIV/0!"},{"$f":"AS218*'Input Screen'!$C$21/1000000","v":{"$error":"#DIV/0!"}}]
[null,null,null,null,null,null,null,null,null,null,null,null,null,null,null,null,null,null,null,{"$error":"#DIV/0!"},{"$f":"'Input Screen'!$C$8*5280*'Input Screen'!$C$9*2*(T219-$T$6)/12*0.0575","v":{"$error":"#DIV/0!"}},{"$f":"U219/'Input Screen'!$C$8","v":{"$error":"#DIV/0!"}},{"$error":"#DIV/0!"},{"$error":"#DIV/0!"},{"$f":"U219*'Input Screen'!$C$21/1000000","v":{"$error":"#DIV/0!"}},21.400000000000034,{"$error":"#VALUE!"},{"$error":"#VALUE!"},null,null,null,null,null,null,null,null,null,null,null,null,null,null,null,null,{"$f":"'Input Screen'!$C$8*5280*$AU$4*'Input Screen'!$C$9*2*(T219-$T$6)/12*0.0575","v":{"$error":"#DIV/0!"}},{"$error":"#DIV/0!"},{"$f":"AS219/($AU$4*'Input Screen'!$C$8)","v":{"$error":"#DIV/0!"}},{"$error":"#DIV/0!"},{"$error":"#DIV/0!"},{"$f":"AS219*'Input Screen'!$C$21/1000000","v":{"$error":"#DIV/0!"}}]
[null,null,null,null,null,null,null,null,null,null,null,null,null,null,null,null,null,null,null,{"$error":"#DIV/0!"},{"$f":"'Input Screen'!$C$8*5280*'Input Screen'!$C$9*2*(T220-$T$6)/12*0.0575","v":{"$error":"#DIV/0!"}},{"$f":"U220/'Input Screen'!$C$8","v":{"$error":"#DIV/0!"}},{"$error":"#DIV/0!"},{"$error":"#DIV/0!"},{"$f":"U220*'Input Screen'!$C$21/1000000","v":{"$error":"#DIV/0!"}},21.500000000000036,{"$error":"#VALUE!"},{"$error":"#VALUE!"},null,null,null,null,null,null,null,null,null,null,null,null,null,null,null,null,{"$f":"'Input Screen'!$C$8*5280*$AU$4*'Input Screen'!$C$9*2*(T220-$T$6)/12*0.0575","v":{"$error":"#DIV/0!"}},{"$error":"#DIV/0!"},{"$f":"AS220/($AU$4*'Input Screen'!$C$8)","v":{"$error":"#DIV/0!"}},{"$error":"#DIV/0!"},{"$error":"#DIV/0!"},{"$f":"AS220*'Input Screen'!$C$21/1000000","v":{"$error":"#DIV/0!"}}]
[null,null,null,null,null,null,null,null,null,null,null,null,null,null,null,null,null,null,null,{"$error":"#DIV/0!"},{"$f":"'Input Screen'!$C$8*5280*'Input Screen'!$C$9*2*(T221-$T$6)/12*0.0575","v":{"$error":"#DIV/0!"}},{"$f":"U221/'Input Screen'!$C$8","v":{"$error":"#DIV/0!"}},{"$error":"#DIV/0!"},{"$error":"#DIV/0!"},{"$f":"U221*'Input Screen'!$C$21/1000000","v":{"$error":"#DIV/0!"}},21.600000000000037,{"$error":"#VALUE!"},{"$error":"#VALUE!"},null,null,null,null,null,null,null,null,null,null,null,null,null,null,null,null,{"$f":"'Input Screen'!$C$8*5280*$AU$4*'Input Screen'!$C$9*2*(T221-$T$6)/12*0.0575","v":{"$error":"#DIV/0!"}},{"$error":"#DIV/0!"},{"$f":"AS221/($AU$4*'Input Screen'!$C$8)","v":{"$error":"#DIV/0!"}},{"$error":"#DIV/0!"},{"$error":"#DIV/0!"},{"$f":"AS221*'Input Screen'!$C$21/1000000","v":{"$error":"#DIV/0!"}}]
[null,null,null,null,null,null,null,null,null,null,null,null,null,null,null,null,null,null,null,{"$error":"#DIV/0!"},{"$f":"'Input Screen'!$C$8*5280*'Input Screen'!$C$9*2*(T222-$T$6)/12*0.0575","v":{"$error":"#DIV/0!"}},{"$f":"U222/'Input Screen'!$C$8","v":{"$error":"#DIV/0!"}},{"$error":"#DIV/0!"},{"$error":"#DIV/0!"},{"$f":"U222*'Input Screen'!$C$21/1000000","v":{"$error":"#DIV/0!"}},21.700000000000038,{"$error":"#VALUE!"},{"$error":"#VALUE!"},null,null,null,null,null,null,null,null,null,null,null,null,null,null,null,null,{"$f":"'Input Screen'!$C$8*5280*$AU$4*'Input Screen'!$C$9*2*(T222-$T$6)/12*0.0575","v":{"$error":"#DIV/0!"}},{"$error":"#DIV/0!"},{"$f":"AS222/($AU$4*'Input Screen'!$C$8)","v":{"$error":"#DIV/0!"}},{"$error":"#DIV/0!"},{"$error":"#DIV/0!"},{"$f":"AS222*'Input Screen'!$C$21/1000000","v":{"$error":"#DIV/0!"}}]
[null,null,null,null,null,null,null,null,null,null,null,null,null,null,null,null,null,null,null,{"$error":"#DIV/0!"},{"$f":"'Input Screen'!$C$8*5280*'Input Screen'!$C$9*2*(T223-$T$6)/12*0.0575","v":{"$error":"#DIV/0!"}},{"$f":"U223/'Input Screen'!$C$8","v":{"$error":"#DIV/0!"}},{"$error":"#DIV/0!"},{"$error":"#DIV/0!"},{"$f":"U223*'Input Screen'!$C$21/1000000","v":{"$error":"#DIV/0!"}},21.80000000000004,{"$error":"#VALUE!"},{"$error":"#VALUE!"},null,null,null,null,null,null,null,null,null,null,null,null,null,null,null,null,{"$f":"'Input Screen'!$C$8*5280*$AU$4*'Input Screen'!$C$9*2*(T223-$T$6)/12*0.0575","v":{"$error":"#DIV/0!"}},{"$error":"#DIV/0!"},{"$f":"AS223/($AU$4*'Input Screen'!$C$8)","v":{"$error":"#DIV/0!"}},{"$error":"#DIV/0!"},{"$error":"#DIV/0!"},{"$f":"AS223*'Input Screen'!$C$21/1000000","v":{"$error":"#DIV/0!"}}]
[null,null,null,null,null,null,null,null,null,null,null,null,null,null,null,null,null,null,null,{"$error":"#DIV/0!"},{"$f":"'Input Screen'!$C$8*5280*'Input Screen'!$C$9*2*(T224-$T$6)/12*0.0575","v":{"$error":"#DIV/0!"}},{"$f":"U224/'Input Screen'!$C$8","v":{"$error":"#DIV/0!"}},{"$error":"#DIV/0!"},{"$error":"#DIV/0!"},{"$f":"U224*'Input Screen'!$C$21/1000000","v":{"$error":"#DIV/0!"}},21.900000000000041,{"$error":"#VALUE!"},{"$error":"#VALUE!"},null,null,null,null,null,null,null,null,null,null,null,null,null,null,null,null,{"$f":"'Input Screen'!$C$8*5280*$AU$4*'Input Screen'!$C$9*2*(T224-$T$6)/12*0.0575","v":{"$error":"#DIV/0!"}},{"$error":"#DIV/0!"},{"$f":"AS224/($AU$4*'Input Screen'!$C$8)","v":{"$error":"#DIV/0!"}},{"$error":"#DIV/0!"},{"$error":"#DIV/0!"},{"$f":"AS224*'Input Screen'!$C$21/1000000","v":{"$error":"#DIV/0!"}}]
[null,null,null,null,null,null,null,null,null,null,null,null,null,null,null,null,null,null,null,{"$error":"#DIV/0!"},{"$f":"'Input Screen'!$C$8*5280*'Input Screen'!$C$9*2*(T225-$T$6)/12*0.0575","v":{"$error":"#DIV/0!"}},{"$f":"U225/'Input Screen'!$C$8","v":{"$error":"#DIV/0!"}},{"$error":"#DIV/0!"},{"$error":"#DIV/0!"},{"$f":"U225*'Input Screen'!$C$21/1000000","v":{"$error":"#DIV/0!"}},22.000000000000043,{"$error":"#VALUE!"},{"$error":"#VALUE!"},null,null,null,null,null,null,null,null,null,null,null,null,null,null,null,null,{"$f":"'Input Screen'!$C$8*5280*$AU$4*'Input Screen'!$C$9*2*(T225-$T$6)/12*0.0575","v":{"$error":"#DIV/0!"}},{"$error":"#DIV/0!"},{"$f":"AS225/($AU$4*'Input Screen'!$C$8)","v":{"$error":"#DIV/0!"}},{"$error":"#DIV/0!"},{"$error":"#DIV/0!"},{"$f":"AS225*'Input Screen'!$C$21/1000000","v":{"$error":"#DIV/0!"}}]
[null,null,null,null,null,null,null,null,null,null,null,null,null,null,null,null,null,null,null,{"$error":"#DIV/0!"},{"$f":"'Input Screen'!$C$8*5280*'Input Screen'!$C$9*2*(T226-$T$6)/12*0.0575","v":{"$error":"#DIV/0!"}},{"$f":"U226/'Input Screen'!$C$8","v":{"$error":"#DIV/0!"}},{"$error":"#DIV/0!"},{"$error":"#DIV/0!"},{"$f":"U226*'Input Screen'!$C$21/1000000","v":{"$error":"#DIV/0!"}},22.100000000000044,{"$error":"#VALUE!"},{"$error":"#VALUE!"},null,null,null,null,null,null,null,null,null,null,null,null,null,null,null,null,{"$f":"'Input Screen'!$C$8*5280*$AU$4*'Input Screen'!$C$9*2*(T226-$T$6)/12*0.0575","v":{"$error":"#DIV/0!"}},{"$error":"#DIV/0!"},{"$f":"AS226/($AU$4*'Input Screen'!$C$8)","v":{"$error":"#DIV/0!"}},{"$error":"#DIV/0!"},{"$error":"#DIV/0!"},{"$f":"AS226*'Input Screen'!$C$21/1000000","v":{"$error":"#DIV/0!"}}]
[null,null,null,null,null,null,null,null,null,null,null,null,null,null,null,null,null,null,null,{"$error":"#DIV/0!"},{"$f":"'Input Screen'!$C$8*5280*'Input Screen'!$C$9*2*(T227-$T$6)/12*0.0575","v":{"$error":"#DIV/0!"}},{"$f":"U227/'Input Screen'!$C$8","v":{"$error":"#DIV/0!"}},{"$error":"#DIV/0!"},{"$error":"#DIV/0!"},{"$f":"U227*'Input Screen'!$C$21/1000000","v":{"$error":"#DIV/0!"}},22.200000000000045,{"$error":"#VALUE!"},{"$error":"#VALUE!"},null,null,null,null,null,null,null,null,null,null,null,null,null,null,null,null,{"$f":"'Input Screen'!$C$8*5280*$AU$4*'Input Screen'!$C$9*2*(T227-$T$6)/12*0.0575","v":{"$error":"#DIV/0!"}},{"$error":"#DIV/0!"},{"$f":"AS227/($AU$4*'Input Screen'!$C$8)","v":{"$error":"#DIV/0!"}},{"$error":"#DIV/0!"},{"$error":"#DIV/0!"},{"$f":"AS227*'Input Screen'!$C$21/1000000","v":{"$error":"#DIV/0!"}}]
[null,null,null,null,null,null,null,null,null,null,null,null,null,null,null,null,null,null,null,{"$error":"#DIV/0!"},{"$f":"'Input Screen'!$C$8*5280*'Input Screen'!$C$9*2*(T228-$T$6)/12*0.0575","v":{"$error":"#DIV/0!"}},{"$f":"U228/'Input Screen'!$C$8","v":{"$error":"#DIV/0!"}},{"$error":"#DIV/0!"},{"$error":"#DIV/0!"},{"$f":"U228*'Input Screen'!$C$21/1000000","v":{"$error":"#DIV/0!"}},22.300000000000047,{"$error":"#VALUE!"},{"$error":"#VALUE!"},null,null,null,null,null,null,null,null,null,null,null,null,null,null,null,null,{"$f":"'Input Screen'!$C$8*5280*$AU$4*'Input Screen'!$C$9*2*(T228-$T$6)/12*0.0575","v":{"$error":"#DIV/0!"}},{"$error":"#DIV/0!"},{"$f":"AS228/($AU$4*'Input Screen'!$C$8)","v":{"$error":"#DIV/0!"}},{"$error":"#DIV/0!"},{"$error":"#DIV/0!"},{"$f":"AS228*'Input Screen'!$C$21/1000000","v":{"$error":"#DIV/0!"}}]
[null,null,null,null,null,null,null,null,null,null,null,null,null,null,null,null,null,null,null,{"$error":"#DIV/0!"},{"$f":"'Input Screen'!$C$8*5280*'Input Screen'!$C$9*2*(T229-$T$6)/12*0.0575","v":{"$error":"#DIV/0!"}},{"$f":"U229/'Input Screen'!$C$8","v":{"$error":"#DIV/0!"}},{"$error":"#DIV/0!"},{"$error":"#DIV/0!"},{"$f":"U229*'Input Screen'!$C$21/1000000","v":{"$error":"#DIV/0!"}},22.400000000000048,{"$error":"#VALUE!"},{"$error":"#VALUE!"},null,null,null,null,null,null,null,null,null,null,null,null,null,null,null,null,{"$f":"'Input Screen'!$C$8*5280*$AU$4*'Input Screen'!$C$9*2*(T229-$T$6)/12*0.0575","v":{"$error":"#DIV/0!"}},{"$error":"#DIV/0!"},{"$f":"AS229/($AU$4*'Input Screen'!$C$8)","v":{"$error":"#DIV/0!"}},{"$error":"#DIV/0!"},{"$error":"#DIV/0!"},{"$f":"AS229*'Input Screen'!$C$21/1000000","v":{"$error":"#DIV/0!"}}]
[null,null,null,null,null,null,null,null,null,null,null,null,null,null,null,null,null,null,null,{"$error":"#DIV/0!"},{"$f":"'Input Screen'!$C$8*5280*'Input Screen'!$C$9*2*(T230-$T$6)/12*0.0575","v":{"$error":"#DIV/0!"}},{"$f":"U230/'Input Screen'!$C$8","v":{"$error":"#DIV/0!"}},{"$error":"#DIV/0!"},{"$error":"#DIV/0!"},{"$f":"U230*'Input Screen'!$C$21/1000000","v":{"$error":"#DIV/0!"}},22.50000000000005,{"$error":"#VALUE!"},{"$error":"#VALUE!"},null,null,null,null,null,null,null,null,null,null,null,null,null,null,null,null,{"$f":"'Input Screen'!$C$8*5280*$AU$4*'Input Screen'!$C$9*2*(T230-$T$6)/12*0.0575","v":{"$error":"#DIV/0!"}},{"$error":"#DIV/0!"},{"$f":"AS230/($AU$4*'Input Screen'!$C$8)","v":{"$error":"#DIV/0!"}},{"$error":"#DIV/0!"},{"$error":"#DIV/0!"},{"$f":"AS230*'Input Screen'!$C$21/1000000","v":{"$error":"#DIV/0!"}}]
[null,null,null,null,null,null,null,null,null,null,null,null,null,null,null,null,null,null,null,{"$error":"#DIV/0!"},{"$f":"'Input Screen'!$C$8*5280*'Input Screen'!$C$9*2*(T231-$T$6)/12*0.0575","v":{"$error":"#DIV/0!"}},{"$f":"U231/'Input Screen'!$C$8","v":{"$error":"#DIV/0!"}},{"$error":"#DIV/0!"},{"$error":"#DIV/0!"},{"$f":"U231*'Input Screen'!$C$21/1000000","v":{"$error":"#DIV/0!"}},22.600000000000051,{"$error":"#VALUE!"},{"$error":"#VALUE!"},null,null,null,null,null,null,null,null,null,null,null,null,null,null,null,null,{"$f":"'Input Screen'!$C$8*5280*$AU$4*'Input Screen'!$C$9*2*(T231-$T$6)/12*0.0575","v":{"$error":"#DIV/0!"}},{"$error":"#DIV/0!"},{"$f":"AS231/($AU$4*'Input Screen'!$C$8)","v":{"$error":"#DIV/0!"}},{"$error":"#DIV/0!"},{"$error":"#DIV/0!"},{"$f":"AS231*'Input Screen'!$C$21/1000000","v":{"$error":"#DIV/0!"}}]
[null,null,null,null,null,null,null,null,null,null,null,null,null,null,null,null,null,null,null,{"$error":"#DIV/0!"},{"$f":"'Input Screen'!$C$8*5280*'Input Screen'!$C$9*2*(T232-$T$6)/12*0.0575","v":{"$error":"#DIV/0!"}},{"$f":"U232/'Input Screen'!$C$8","v":{"$error":"#DIV/0!"}},{"$error":"#DIV/0!"},{"$error":"#DIV/0!"},{"$f":"U232*'Input Screen'!$C$21/1000000","v":{"$error":"#DIV/0!"}},22.700000000000053,{"$error":"#VALUE!"},{"$error":"#VALUE!"},null,null,null,null,null,null,null,null,null,null,null,null,null,null,null,null,{"$f":"'Input Screen'!$C$8*5280*$AU$4*'Input Screen'!$C$9*2*(T232-$T$6)/12*0.0575","v":{"$error":"#DIV/0!"}},{"$error":"#DIV/0!"},{"$f":"AS232/($AU$4*'Input Screen'!$C$8)","v":{"$error":"#DIV/0!"}},{"$error":"#DIV/0!"},{"$error":"#DIV/0!"},{"$f":"AS232*'Input Screen'!$C$21/1000000","v":{"$error":"#DIV/0!"}}]
[null,null,null,null,null,null,null,null,null,null,null,null,null,null,null,null,null,null,null,{"$error":"#DIV/0!"},{"$f":"'Input Screen'!$C$8*5280*'Input Screen'!$C$9*2*(T233-$T$6)/12*0.0575","v":{"$error":"#DIV/0!"}},{"$f":"U233/'Input Screen'!$C$8","v":{"$error":"#DIV/0!"}},{"$error":"#DIV/0!"},{"$error":"#DIV/0!"},{"$f":"U233*'Input Screen'!$C$21/1000000","v":{"$error":"#DIV/0!"}},22.800000000000054,{"$error":"#VALUE!"},{"$error":"#VALUE!"},null,null,null,null,null,null,null,null,null,null,null,null,null,null,null,null,{"$f":"'Input Screen'!$C$8*5280*$AU$4*'Input Screen'!$C$9*2*(T233-$T$6)/12*0.0575","v":{"$error":"#DIV/0!"}},{"$error":"#DIV/0!"},{"$f":"AS233/($AU$4*'Input Screen'!$C$8)","v":{"$error":"#DIV/0!"}},{"$error":"#DIV/0!"},{"$error":"#DIV/0!"},{"$f":"AS233*'Input Screen'!$C$21/1000000","v":{"$error":"#DIV/0!"}}]
[null,null,null,null,null,null,null,null,null,null,null,null,null,null,null,null,null,null,null,{"$error":"#DIV/0!"},{"$f":"'Input Screen'!$C$8*5280*'Input Screen'!$C$9*2*(T234-$T$6)/12*0.0575","v":{"$error":"#DIV/0!"}},{"$f":"U234/'Input Screen'!$C$8","v":{"$error":"#DIV/0!"}},{"$error":"#DIV/0!"},{"$error":"#DIV/0!"},{"$f":"U234*'Input Screen'!$C$21/1000000","v":{"$error":"#DIV/0!"}},22.900000000000055,{"$error":"#VALUE!"},{"$error":"#VALUE!"},null,null,null,null,null,null,null,null,null,null,null,null,null,null,null,null,{"$f":"'Input Screen'!$C$8*5280*$AU$4*'Input Screen'!$C$9*2*(T234-$T$6)/12*0.0575","v":{"$error":"#DIV/0!"}},{"$error":"#DIV/0!"},{"$f":"AS234/($AU$4*'Input Screen'!$C$8)","v":{"$error":"#DIV/0!"}},{"$error":"#DIV/0!"},{"$error":"#DIV/0!"},{"$f":"AS234*'Input Screen'!$C$21/1000000","v":{"$error":"#DIV/0!"}}]
[null,null,null,null,null,null,null,null,null,null,null,null,null,null,null,null,null,null,null,{"$error":"#DIV/0!"},{"$f":"'Input Screen'!$C$8*5280*'Input Screen'!$C$9*2*(T235-$T$6)/12*0.0575","v":{"$error":"#DIV/0!"}},{"$f":"U235/'Input Screen'!$C$8","v":{"$error":"#DIV/0!"}},{"$error":"#DIV/0!"},{"$error":"#DIV/0!"},{"$f":"U235*'Input Screen'!$C$21/1000000","v":{"$error":"#DIV/0!"}},23.000000000000057,{"$error":"#VALUE!"},{"$error":"#VALUE!"},null,null,null,null,null,null,null,null,null,null,null,null,null,null,null,null,{"$f":"'Input Screen'!$C$8*5280*$AU$4*'Input Screen'!$C$9*2*(T235-$T$6)/12*0.0575","v":{"$error":"#DIV/0!"}},{"$error":"#DIV/0!"},{"$f":"AS235/($AU$4*'Input Screen'!$C$8)","v":{"$error":"#DIV/0!"}},{"$error":"#DIV/0!"},{"$error":"#DIV/0!"},{"$f":"AS235*'Input Screen'!$C$21/1000000","v":{"$error":"#DIV/0!"}}]
[null,null,null,null,null,null,null,null,null,null,null,null,null,null,null,null,null,null,null,{"$error":"#DIV/0!"},{"$f":"'Input Screen'!$C$8*5280*'Input Screen'!$C$9*2*(T236-$T$6)/12*0.0575","v":{"$error":"#DIV/0!"}},{"$f":"U236/'Input Screen'!$C$8","v":{"$error":"#DIV/0!"}},{"$error":"#DIV/0!"},{"$error":"#DIV/0!"},{"$f":"U236*'Input Screen'!$C$21/1000000","v":{"$error":"#DIV/0!"}},23.100000000000058,{"$error":"#VALUE!"},{"$error":"#VALUE!"},null,null,null,null,null,null,null,null,null,null,null,null,null,null,null,null,{"$f":"'Input Screen'!$C$8*5280*$AU$4*'Input Screen'!$C$9*2*(T236-$T$6)/12*0.0575","v":{"$error":"#DIV/0!"}},{"$error":"#DIV/0!"},{"$f":"AS236/($AU$4*'Input Screen'!$C$8)","v":{"$error":"#DIV/0!"}},{"$error":"#DIV/0!"},{"$error":"#DIV/0!"},{"$f":"AS236*'Input Screen'!$C$21/1000000","v":{"$error":"#DIV/0!"}}]
[null,null,null,null,null,null,null,null,null,null,null,null,null,null,null,null,null,null,null,{"$error":"#DIV/0!"},{"$f":"'Input Screen'!$C$8*5280*'Input Screen'!$C$9*2*(T237-$T$6)/12*0.0575","v":{"$error":"#DIV/0!"}},{"$f":"U237/'Input Screen'!$C$8","v":{"$error":"#DIV/0!"}},{"$error":"#DIV/0!"},{"$error":"#DIV/0!"},{"$f":"U237*'Input Screen'!$C$21/1000000","v":{"$error":"#DIV/0!"}},23.20000000000006,{"$error":"#VALUE!"},{"$error":"#VALUE!"},null,null,null,null,null,null,null,null,null,null,null,null,null,null,null,null,{"$f":"'Input Screen'!$C$8*5280*$AU$4*'Input Screen'!$C$9*2*(T237-$T$6)/12*0.0575","v":{"$error":"#DIV/0!"}},{"$error":"#DIV/0!"},{"$f":"AS237/($AU$4*'Input Screen'!$C$8)","v":{"$error":"#DIV/0!"}},{"$error":"#DIV/0!"},{"$error":"#DIV/0!"},{"$f":"AS237*'Input Screen'!$C$21/1000000","v":{"$error":"#DIV/0!"}}]
[null,null,null,null,null,null,null,null,null,null,null,null,null,null,null,null,null,null,null,{"$error":"#DIV/0!"},{"$f":"'Input Screen'!$C$8*5280*'Input Screen'!$C$9*2*(T238-$T$6)/12*0.0575","v":{"$error":"#DIV/0!"}},{"$f":"U238/'Input Screen'!$C$8","v":{"$error":"#DIV/0!"}},{"$error":"#DIV/0!"},{"$error":"#DIV/0!"},{"$f":"U238*'Input Screen'!$C$21/1000000","v":{"$error":"#DIV/0!"}},23.300000000000061,{"$error":"#VALUE!"},{"$error":"#VALUE!"},null,null,null,null,null,null,null,null,null,null,null,null,null,null,null,null,{"$f":"'Input Screen'!$C$8*5280*$AU$4*'Input Screen'!$C$9*2*(T238-$T$6)/12*0.0575","v":{"$error":"#DIV/0!"}},{"$error":"#DIV/0!"},{"$f":"AS238/($AU$4*'Input Screen'!$C$8)","v":{"$error":"#DIV/0!"}},{"$error":"#DIV/0!"},{"$error":"#DIV/0!"},{"$f":"AS238*'Input Screen'!$C$21/1000000","v":{"$error":"#DIV/0!"}}]
[null,null,null,null,null,null,null,null,null,null,null,null,null,null,null,null,null,null,null,{"$error":"#DIV/0!"},{"$f":"'Input Screen'!$C$8*5280*'Input Screen'!$C$9*2*(T239-$T$6)/12*0.0575","v":{"$error":"#DIV/0!"}},{"$f":"U239/'Input Screen'!$C$8","v":{"$error":"#DIV/0!"}},{"$error":"#DIV/0!"},{"$error":"#DIV/0!"},{"$f":"U239*'Input Screen'!$C$21/1000000","v":{"$error":"#DIV/0!"}},23.400000000000063,{"$error":"#VALUE!"},{"$error":"#VALUE!"},null,null,null,null,null,null,null,null,null,null,null,null,null,null,null,null,{"$f":"'Input Screen'!$C$8*5280*$AU$4*'Input Screen'!$C$9*2*(T239-$T$6)/12*0.0575","v":{"$error":"#DIV/0!"}},{"$error":"#DIV/0!"},{"$f":"AS239/($AU$4*'Input Screen'!$C$8)","v":{"$error":"#DIV/0!"}},{"$error":"#DIV/0!"},{"$error":"#DIV/0!"},{"$f":"AS239*'Input Screen'!$C$21/1000000","v":{"$error":"#DIV/0!"}}]
[null,null,null,null,null,null,null,null,null,null,null,null,null,null,null,null,null,null,null,{"$error":"#DIV/0!"},{"$f":"'Input Screen'!$C$8*5280*'Input Screen'!$C$9*2*(T240-$T$6)/12*0.0575","v":{"$error":"#DIV/0!"}},{"$f":"U240/'Input Screen'!$C$8","v":{"$error":"#DIV/0!"}},{"$error":"#DIV/0!"},{"$error":"#DIV/0!"},{"$f":"U240*'Input Screen'!$C$21/1000000","v":{"$error":"#DIV/0!"}},23.500000000000064,{"$error":"#VALUE!"},{"$error":"#VALUE!"},null,null,null,null,null,null,null,null,null,null,null,null,null,null,null,null,{"$f":"'Input Screen'!$C$8*5280*$AU$4*'Input Screen'!$C$9*2*(T240-$T$6)/12*0.0575","v":{"$error":"#DIV/0!"}},{"$error":"#DIV/0!"},{"$f":"AS240/($AU$4*'Input Screen'!$C$8)","v":{"$error":"#DIV/0!"}},{"$error":"#DIV/0!"},{"$error":"#DIV/0!"},{"$f":"AS240*'Input Screen'!$C$21/1000000","v":{"$error":"#DIV/0!"}}]
[null,null,null,null,null,null,null,null,null,null,null,null,null,null,null,null,null,null,null,{"$error":"#DIV/0!"},{"$f":"'Input Screen'!$C$8*5280*'Input Screen'!$C$9*2*(T241-$T$6)/12*0.0575","v":{"$error":"#DIV/0!"}},{"$f":"U241/'Input Screen'!$C$8","v":{"$error":"#DIV/0!"}},{"$error":"#DIV/0!"},{"$error":"#DIV/0!"},{"$f":"U241*'Input Screen'!$C$21/1000000","v":{"$error":"#DIV/0!"}},23.600000000000065,{"$error":"#VALUE!"},{"$error":"#VALUE!"},null,null,null,null,null,null,null,null,null,null,null,null,null,null,null,null,{"$f":"'Input Screen'!$C$8*5280*$AU$4*'Input Screen'!$C$9*2*(T241-$T$6)/12*0.0575","v":{"$error":"#DIV/0!"}},{"$error":"#DIV/0!"},{"$f":"AS241/($AU$4*'Input Screen'!$C$8)","v":{"$error":"#DIV/0!"}},{"$error":"#DIV/0!"},{"$error":"#DIV/0!"},{"$f":"AS241*'Input Screen'!$C$21/1000000","v":{"$error":"#DIV/0!"}}]
[null,null,null,null,null,null,null,null,null,null,null,null,null,null,null,null,null,null,null,{"$error":"#DIV/0!"},{"$f":"'Input Screen'!$C$8*5280*'Input Screen'!$C$9*2*(T242-$T$6)/12*0.0575","v":{"$error":"#DIV/0!"}},{"$f":"U242/'Input Screen'!$C$8","v":{"$error":"#DIV/0!"}},{"$error":"#DIV/0!"},{"$error":"#DIV/0!"},{"$f":"U242*'Input Screen'!$C$21/1000000","v":{"$error":"#DIV/0!"}},23.700000000000067,{"$error":"#VALUE!"},{"$error":"#VALUE!"},null,null,null,null,null,null,null,null,null,null,null,null,null,null,null,null,{"$f":"'Input Screen'!$C$8*5280*$AU$4*'Input Screen'!$C$9*2*(T242-$T$6)/12*0.0575","v":{"$error":"#DIV/0!"}},{"$error":"#DIV/0!"},{"$f":"AS242/($AU$4*'Input Screen'!$C$8)","v":{"$error":"#DIV/0!"}},{"$error":"#DIV/0!"},{"$error":"#DIV/0!"},{"$f":"AS242*'Input Screen'!$C$21/1000000","v":{"$error":"#DIV/0!"}}]
[null,null,null,null,null,null,null,null,null,null,null,null,null,null,null,null,null,null,null,{"$error":"#DIV/0!"},{"$f":"'Input Screen'!$C$8*5280*'Input Screen'!$C$9*2*(T243-$T$6)/12*0.0575","v":{"$error":"#DIV/0!"}},{"$f":"U243/'Input Screen'!$C$8","v":{"$error":"#DIV/0!"}},{"$error":"#DIV/0!"},{"$error":"#DIV/0!"},{"$f":"U243*'Input Screen'!$C$21/1000000","v":{"$error":"#DIV/0!"}},23.800000000000068,{"$error":"#VALUE!"},{"$error":"#VALUE!"},null,null,null,null,null,null,null,null,null,null,null,null,null,null,null,null,{"$f":"'Input Screen'!$C$8*5280*$AU$4*'Input Screen'!$C$9*2*(T243-$T$6)/12*0.0575","v":{"$error":"#DIV/0!"}},{"$error":"#DIV/0!"},{"$f":"AS243/($AU$4*'Input Screen'!$C$8)","v":{"$error":"#DIV/0!"}},{"$error":"#DIV/0!"},{"$error":"#DIV/0!"},{"$f":"AS243*'Input Screen'!$C$21/1000000","v":{"$error":"#DIV/0!"}}]
[null,null,null,null,null,null,null,null,null,null,null,null,null,null,null,null,null,null,null,{"$error":"#DIV/0!"},{"$f":"'Input Screen'!$C$8*5280*'Input Screen'!$C$9*2*(T244-$T$6)/12*0.0575","v":{"$error":"#DIV/0!"}},{"$f":"U244/'Input Screen'!$C$8","v":{"$error":"#DIV/0!"}},{"$error":"#DIV/0!"},{"$error":"#DIV/0!"},{"$f":"U244*'Input Screen'!$C$21/1000000","v":{"$error":"#DIV/0!"}},23.90000000000007,{"$error":"#VALUE!"},{"$error":"#VALUE!"},null,null,null,null,null,null,null,null,null,null,null,null,null,null,null,null,{"$f":"'Input Screen'!$C$8*5280*$AU$4*'Input Screen'!$C$9*2*(T244-$T$6)/12*0.0575","v":{"$error":"#DIV/0!"}},{"$error":"#DIV/0!"},{"$f":"AS244/($AU$4*'Input Screen'!$C$8)","v":{"$error":"#DIV/0!"}},{"$error":"#DIV/0!"},{"$error":"#DIV/0!"},{"$f":"AS244*'Input Screen'!$C$21/1000000","v":{"$error":"#DIV/0!"}}]
[null,null,null,null,null,null,null,null,null,null,null,null,null,null,null,null,null,null,null,{"$error":"#DIV/0!"},{"$f":"'Input Screen'!$C$8*5280*'Input Screen'!$C$9*2*(T245-$T$6)/12*0.0575","v":{"$error":"#DIV/0!"}},{"$f":"U245/'Input Screen'!$C$8","v":{"$error":"#DIV/0!"}},{"$error":"#DIV/0!"},{"$error":"#DIV/0!"},{"$f":"U245*'Input Screen'!$C$21/1000000","v":{"$error":"#DIV/0!"}},24.000000000000071,{"$error":"#VALUE!"},{"$error":"#VALUE!"},null,null,null,null,null,null,null,null,null,null,null,null,null,null,null,null,{"$f":"'Input Screen'!$C$8*5280*$AU$4*'Input Screen'!$C$9*2*(T245-$T$6)/12*0.0575","v":{"$error":"#DIV/0!"}},{"$error":"#DIV/0!"},{"$f":"AS245/($AU$4*'Input Screen'!$C$8)","v":{"$error":"#DIV/0!"}},{"$error":"#DIV/0!"},{"$error":"#DIV/0!"},{"$f":"AS245*'Input Screen'!$C$21/1000000","v":{"$error":"#DIV/0!"}}]
[null,null,null,null,null,null,null,null,null,null,null,null,null,null,null,null,null,null,null,{"$error":"#DIV/0!"},{"$f":"'Input Screen'!$C$8*5280*'Input Screen'!$C$9*2*(T246-$T$6)/12*0.0575","v":{"$error":"#DIV/0!"}},{"$f":"U246/'Input Screen'!$C$8","v":{"$error":"#DIV/0!"}},{"$error":"#DIV/0!"},{"$error":"#DIV/0!"},{"$f":"U246*'Input Screen'!$C$21/1000000","v":{"$error":"#DIV/0!"}},24.100000000000072,{"$error":"#VALUE!"},{"$error":"#VALUE!"},null,null,null,null,null,null,null,null,null,null,null,null,null,null,null,null,{"$f":"'Input Screen'!$C$8*5280*$AU$4*'Input Screen'!$C$9*2*(T246-$T$6)/12*0.0575","v":{"$error":"#DIV/0!"}},{"$error":"#DIV/0!"},{"$f":"AS246/($AU$4*'Input Screen'!$C$8)","v":{"$error":"#DIV/0!"}},{"$error":"#DIV/0!"},{"$error":"#DIV/0!"},{"$f":"AS246*'Input Screen'!$C$21/1000000","v":{"$error":"#DIV/0!"}}]
[null,null,null,null,null,null,null,null,null,null,null,null,null,null,null,null,null,null,null,{"$error":"#DIV/0!"},{"$f":"'Input Screen'!$C$8*5280*'Input Screen'!$C$9*2*(T247-$T$6)/12*0.0575","v":{"$error":"#DIV/0!"}},{"$f":"U247/'Input Screen'!$C$8","v":{"$error":"#DIV/0!"}},{"$error":"#DIV/0!"},{"$error":"#DIV/0!"},{"$f":"U247*'Input Screen'!$C$21/1000000","v":{"$error":"#DIV/0!"}},24.200000000000074,{"$error":"#VALUE!"},{"$error":"#VALUE!"},null,null,null,null,null,null,null,null,null,null,null,null,null,null,null,null,{"$f":"'Input Screen'!$C$8*5280*$AU$4*'Input Screen'!$C$9*2*(T247-$T$6)/12*0.0575","v":{"$error":"#DIV/0!"}},{"$error":"#DIV/0!"},{"$f":"AS247/($AU$4*'Input Screen'!$C$8)","v":{"$error":"#DIV/0!"}},{"$error":"#DIV/0!"},{"$error":"#DIV/0!"},{"$f":"AS247*'Input Screen'!$C$21/1000000","v":{"$error":"#DIV/0!"}}]
[null,null,null,null,null,null,null,null,null,null,null,null,null,null,null,null,null,null,null,{"$error":"#DIV/0!"},{"$f":"'Input Screen'!$C$8*5280*'Input Screen'!$C$9*2*(T248-$T$6)/12*0.0575","v":{"$error":"#DIV/0!"}},{"$f":"U248/'Input Screen'!$C$8","v":{"$error":"#DIV/0!"}},{"$error":"#DIV/0!"},{"$error":"#DIV/0!"},{"$f":"U248*'Input Screen'!$C$21/1000000","v":{"$error":"#DIV/0!"}},24.300000000000075,{"$error":"#VALUE!"},{"$error":"#VALUE!"},null,null,null,null,null,null,null,null,null,null,null,null,null,null,null,null,{"$f":"'Input Screen'!$C$8*5280*$AU$4*'Input Screen'!$C$9*2*(T248-$T$6)/12*0.0575","v":{"$error":"#DIV/0!"}},{"$error":"#DIV/0!"},{"$f":"AS248/($AU$4*'Input Screen'!$C$8)","v":{"$error":"#DIV/0!"}},{"$error":"#DIV/0!"},{"$error":"#DIV/0!"},{"$f":"AS248*'Input Screen'!$C$21/1000000","v":{"$error":"#DIV/0!"}}]
[null,null,null,null,null,null,null,null,null,null,null,null,null,null,null,null,null,null,null,{"$error":"#DIV/0!"},{"$f":"'Input Screen'!$C$8*5280*'Input Screen'!$C$9*2*(T249-$T$6)/12*0.0575","v":{"$error":"#DIV/0!"}},{"$f":"U249/'Input Screen'!$C$8","v":{"$error":"#DIV/0!"}},{"$error":"#DIV/0!"},{"$error":"#DIV/0!"},{"$f":"U249*'Input Screen'!$C$21/1000000","v":{"$error":"#DIV/0!"}},24.400000000000077,{"$error":"#VALUE!"},{"$error":"#VALUE!"},null,null,null,null,null,null,null,null,null,null,null,null,null,null,null,null,{"$f":"'Input Screen'!$C$8*5280*$AU$4*'Input Screen'!$C$9*2*(T249-$T$6)/12*0.0575","v":{"$error":"#DIV/0!"}},{"$error":"#DIV/0!"},{"$f":"AS249/($AU$4*'Input Screen'!$C$8)","v":{"$error":"#DIV/0!"}},{"$error":"#DIV/0!"},{"$error":"#DIV/0!"},{"$f":"AS249*'Input Screen'!$C$21/1000000","v":{"$error":"#DIV/0!"}}]
[null,null,null,null,null,null,null,null,null,null,null,null,null,null,null,null,null,null,null,{"$error":"#DIV/0!"},{"$f":"'Input Screen'!$C$8*5280*'Input Screen'!$C$9*2*(T250-$T$6)/12*0.0575","v":{"$error":"#DIV/0!"}},{"$f":"U250/'Input Screen'!$C$8","v":{"$error":"#DIV/0!"}},{"$error":"#DIV/0!"},{"$error":"#DIV/0!"},{"$f":"U250*'Input Screen'!$C$21/1000000","v":{"$error":"#DIV/0!"}},24.500000000000078,{"$error":"#VALUE!"},{"$error":"#VALUE!"},null,null,null,null,null,null,null,null,null,null,null,null,null,null,null,null,{"$f":"'Input Screen'!$C$8*5280*$AU$4*'Input Screen'!$C$9*2*(T250-$T$6)/12*0.0575","v":{"$error":"#DIV/0!"}},{"$error":"#DIV/0!"},{"$f":"AS250/($AU$4*'Input Screen'!$C$8)","v":{"$error":"#DIV/0!"}},{"$error":"#DIV/0!"},{"$error":"#DIV/0!"},{"$f":"AS250*'Input Screen'!$C$21/1000000","v":{"$error":"#DIV/0!"}}]
[null,null,null,null,null,null,null,null,null,null,null,null,null,null,null,null,null,null,null,{"$error":"#DIV/0!"},{"$f":"'Input Screen'!$C$8*5280*'Input Screen'!$C$9*2*(T251-$T$6)/12*0.0575","v":{"$error":"#DIV/0!"}},{"$f":"U251/'Input Screen'!$C$8","v":{"$error":"#DIV/0!"}},{"$error":"#DIV/0!"},{"$error":"#DIV/0!"},{"$f":"U251*'Input Screen'!$C$21/1000000","v":{"$error":"#DIV/0!"}},24.60000000000008,{"$error":"#VALUE!"},{"$error":"#VALUE!"},null,null,null,null,null,null,null,null,null,null,null,null,null,null,null,null,{"$f":"'Input Screen'!$C$8*5280*$AU$4*'Input Screen'!$C$9*2*(T251-$T$6)/12*0.0575","v":{"$error":"#DIV/0!"}},{"$error":"#DIV/0!"},{"$f":"AS251/($AU$4*'Input Screen'!$C$8)","v":{"$error":"#DIV/0!"}},{"$error":"#DIV/0!"},{"$error":"#DIV/0!"},{"$f":"AS251*'Input Screen'!$C$21/1000000","v":{"$error":"#DIV/0!"}}]
[null,null,null,null,null,null,null,null,null,null,null,null,null,null,null,null,null,null,null,{"$error":"#DIV/0!"},{"$f":"'Input Screen'!$C$8*5280*'Input Screen'!$C$9*2*(T252-$T$6)/12*0.0575","v":{"$error":"#DIV/0!"}},{"$f":"U252/'Input Screen'!$C$8","v":{"$error":"#DIV/0!"}},{"$error":"#DIV/0!"},{"$error":"#DIV/0!"},{"$f":"U252*'Input Screen'!$C$21/1000000","v":{"$error":"#DIV/0!"}},24.700000000000081,{"$error":"#VALUE!"},{"$error":"#VALUE!"},null,null,null,null,null,null,null,null,null,null,null,null,null,null,null,null,{"$f":"'Input Screen'!$C$8*5280*$AU$4*'Input Screen'!$C$9*2*(T252-$T$6)/12*0.0575","v":{"$error":"#DIV/0!"}},{"$error":"#DIV/0!"},{"$f":"AS252/($AU$4*'Input Screen'!$C$8)","v":{"$error":"#DIV/0!"}},{"$error":"#DIV/0!"},{"$error":"#DIV/0!"},{"$f":"AS252*'Input Screen'!$C$21/1000000","v":{"$error":"#DIV/0!"}}]
[null,null,null,null,null,null,null,null,null,null,null,null,null,null,null,null,null,null,null,{"$error":"#DIV/0!"},{"$f":"'Input Screen'!$C$8*5280*'Input Screen'!$C$9*2*(T253-$T$6)/12*0.0575","v":{"$error":"#DIV/0!"}},{"$f":"U253/'Input Screen'!$C$8","v":{"$error":"#DIV/0!"}},{"$error":"#DIV/0!"},{"$error":"#DIV/0!"},{"$f":"U253*'Input Screen'!$C$21/1000000","v":{"$error":"#DIV/0!"}},24.800000000000082,{"$error":"#VALUE!"},{"$error":"#VALUE!"},null,null,null,null,null,null,null,null,null,null,null,null,null,null,null,null,{"$f":"'Input Screen'!$C$8*5280*$AU$4*'Input Screen'!$C$9*2*(T253-$T$6)/12*0.0575","v":{"$error":"#DIV/0!"}},{"$error":"#DIV/0!"},{"$f":"AS253/($AU$4*'Input Screen'!$C$8)","v":{"$error":"#DIV/0!"}},{"$error":"#DIV/0!"},{"$error":"#DIV/0!"},{"$f":"AS253*'Input Screen'!$C$21/1000000","v":{"$error":"#DIV/0!"}}]
[null,null,null,null,null,null,null,null,null,null,null,null,null,null,null,null,null,null,null,{"$error":"#DIV/0!"},{"$f":"'Input Screen'!$C$8*5280*'Input Screen'!$C$9*2*(T254-$T$6)/12*0.0575","v":{"$error":"#DIV/0!"}},{"$f":"U254/'Input Screen'!$C$8","v":{"$error":"#DIV/0!"}},{"$error":"#DIV/0!"},{"$error":"#DIV/0!"},{"$f":"U254*'Input Screen'!$C$21/1000000","v":{"$error":"#DIV/0!"}},24.900000000000084,{"$error":"#VALUE!"},{"$error":"#VALUE!"},null,null,null,null,null,null,null,null,null,null,null,null,null,null,null,null,{"$f":"'Input Screen'!$C$8*5280*$AU$4*'Input Screen'!$C$9*2*(T254-$T$6)/12*0.0575","v":{"$error":"#DIV/0!"}},{"$error":"#DIV/0!"},{"$f":"AS254/($AU$4*'Input Screen'!$C$8)","v":{"$error":"#DIV/0!"}},{"$error":"#DIV/0!"},{"$error":"#DIV/0!"},{"$f":"AS254*'Input Screen'!$C$21/1000000","v":{"$error":"#DIV/0!"}}]
[null,null,null,null,null,null,null,null,null,null,null,null,null,null,null,null,null,null,null,{"$error":"#DIV/0!"},{"$f":"'Input Screen'!$C$8*5280*'Input Screen'!$C$9*2*(T255-$T$6)/12*0.0575","v":{"$error":"#DIV/0!"}},{"$f":"U255/'Input Screen'!$C$8","v":{"$error":"#DIV/0!"}},{"$error":"#DIV/0!"},{"$error":"#DIV/0!"},{"$f":"U255*'Input Screen'!$C$21/1000000","v":{"$error":"#DIV/0!"}},25.000000000000085,{"$error":"#VALUE!"},{"$error":"#VALUE!"},null,null,null,null,null,null,null,null,null,null,null,null,null,null,null,null,{"$f":"'Input Screen'!$C$8*5280*$AU$4*'Input Screen'!$C$9*2*(T255-$T$6)/12*0.0575","v":{"$error":"#DIV/0!"}},{"$error":"#DIV/0!"},{"$f":"AS255/($AU$4*'Input Screen'!$C$8)","v":{"$error":"#DIV/0!"}},{"$error":"#DIV/0!"},{"$error":"#DIV/0!"},{"$f":"AS255*'Input Screen'!$C$21/1000000","v":{"$error":"#DIV/0!"}}]
[null,null,null,null,null,null,null,null,null,null,null,null,null,null,null,null,null,null,null,{"$error":"#DIV/0!"},{"$f":"'Input Screen'!$C$8*5280*'Input Screen'!$C$9*2*(T256-$T$6)/12*0.0575","v":{"$error":"#DIV/0!"}},{"$f":"U256/'Input Screen'!$C$8","v":{"$error":"#DIV/0!"}},{"$error":"#DIV/0!"},{"$error":"#DIV/0!"},{"$f":"U256*'Input Screen'!$C$21/1000000","v":{"$error":"#DIV/0!"}},25.100000000000087,{"$error":"#VALUE!"},{"$error":"#VALUE!"},null,null,null,null,null,null,null,null,null,null,null,null,null,null,null,null,{"$f":"'Input Screen'!$C$8*5280*$AU$4*'Input Screen'!$C$9*2*(T256-$T$6)/12*0.0575","v":{"$error":"#DIV/0!"}},{"$error":"#DIV/0!"},{"$f":"AS256/($AU$4*'Input Screen'!$C$8)","v":{"$error":"#DIV/0!"}},{"$error":"#DIV/0!"},{"$error":"#DIV/0!"},{"$f":"AS256*'Input Screen'!$C$21/1000000","v":{"$error":"#DIV/0!"}}]
[null,null,null,null,null,null,null,null,null,null,null,null,null,null,null,null,null,null,null,{"$error":"#DIV/0!"},{"$f":"'Input Screen'!$C$8*5280*'Input Screen'!$C$9*2*(T257-$T$6)/12*0.0575","v":{"$error":"#DIV/0!"}},{"$f":"U257/'Input Screen'!$C$8","v":{"$error":"#DIV/0!"}},{"$error":"#DIV/0!"},{"$error":"#DIV/0!"},{"$f":"U257*'Input Screen'!$C$21/1000000","v":{"$error":"#DIV/0!"}},25.200000000000088,{"$error":"#VALUE!"},{"$error":"#VALUE!"},null,null,null,null,null,null,null,null,null,null,null,null,null,null,null,null,{"$f":"'Input Screen'!$C$8*5280*$AU$4*'Input Screen'!$C$9*2*(T257-$T$6)/12*0.0575","v":{"$error":"#DIV/0!"}},{"$error":"#DIV/0!"},{"$f":"AS257/($AU$4*'Input Screen'!$C$8)","v":{"$error":"#DIV/0!"}},{"$error":"#DIV/0!"},{"$error":"#DIV/0!"},{"$f":"AS257*'Input Screen'!$C$21/1000000","v":{"$error":"#DIV/0!"}}]
[null,null,null,null,null,null,null,null,null,null,null,null,null,null,null,null,null,null,null,{"$error":"#DIV/0!"},{"$f":"'Input Screen'!$C$8*5280*'Input Screen'!$C$9*2*(T258-$T$6)/12*0.0575","v":{"$error":"#DIV/0!"}},{"$f":"U258/'Input Screen'!$C$8","v":{"$error":"#DIV/0!"}},{"$error":"#DIV/0!"},{"$error":"#DIV/0!"},{"$f":"U258*'Input Screen'!$C$21/1000000","v":{"$error":"#DIV/0!"}},25.30000000000009,{"$error":"#VALUE!"},{"$error":"#VALUE!"},null,null,null,null,null,null,null,null,null,null,null,null,null,null,null,null,{"$f":"'Input Screen'!$C$8*5280*$AU$4*'Input Screen'!$C$9*2*(T258-$T$6)/12*0.0575","v":{"$error":"#DIV/0!"}},{"$error":"#DIV/0!"},{"$f":"AS258/($AU$4*'Input Screen'!$C$8)","v":{"$error":"#DIV/0!"}},{"$error":"#DIV/0!"},{"$error":"#DIV/0!"},{"$f":"AS258*'Input Screen'!$C$21/1000000","v":{"$error":"#DIV/0!"}}]
[null,null,null,null,null,null,null,null,null,null,null,null,null,null,null,null,null,null,null,{"$error":"#DIV/0!"},{"$f":"'Input Screen'!$C$8*5280*'Input Screen'!$C$9*2*(T259-$T$6)/12*0.0575","v":{"$error":"#DIV/0!"}},{"$f":"U259/'Input Screen'!$C$8","v":{"$error":"#DIV/0!"}},{"$error":"#DIV/0!"},{"$error":"#DIV/0!"},{"$f":"U259*'Input Screen'!$C$21/1000000","v":{"$error":"#DIV/0!"}},25.400000000000091,{"$error":"#VALUE!"},{"$error":"#VALUE!"},null,null,null,null,null,null,null,null,null,null,null,null,null,null,null,null,{"$f":"'Input Screen'!$C$8*5280*$AU$4*'Input Screen'!$C$9*2*(T259-$T$6)/12*0.0575","v":{"$error":"#DIV/0!"}},{"$error":"#DIV/0!"},{"$f":"AS259/($AU$4*'Input Screen'!$C$8)","v":{"$error":"#DIV/0!"}},{"$error":"#DIV/0!"},{"$error":"#DIV/0!"},{"$f":"AS259*'Input Screen'!$C$21/1000000","v":{"$error":"#DIV/0!"}}]
[null,null,null,null,null,null,null,null,null,null,null,null,null,null,null,null,null,null,null,{"$error":"#DIV/0!"},{"$f":"'Input Screen'!$C$8*5280*'Input Screen'!$C$9*2*(T260-$T$6)/12*0.0575","v":{"$error":"#DIV/0!"}},{"$f":"U260/'Input Screen'!$C$8","v":{"$error":"#DIV/0!"}},{"$error":"#DIV/0!"},{"$error":"#DIV/0!"},{"$f":"U260*'Input Screen'!$C$21/1000000","v":{"$error":"#DIV/0!"}},25.500000000000092,{"$error":"#VALUE!"},{"$error":"#VALUE!"},null,null,null,null,null,null,null,null,null,null,null,null,null,null,null,null,{"$f":"'Input Screen'!$C$8*5280*$AU$4*'Input Screen'!$C$9*2*(T260-$T$6)/12*0.0575","v":{"$error":"#DIV/0!"}},{"$error":"#DIV/0!"},{"$f":"AS260/($AU$4*'Input Screen'!$C$8)","v":{"$error":"#DIV/0!"}},{"$error":"#DIV/0!"},{"$error":"#DIV/0!"},{"$f":"AS260*'Input Screen'!$C$21/1000000","v":{"$error":"#DIV/0!"}}]
[null,null,null,null,null,null,null,null,null,null,null,null,null,null,null,null,null,null,null,{"$error":"#DIV/0!"},{"$f":"'Input Screen'!$C$8*5280*'Input Screen'!$C$9*2*(T261-$T$6)/12*0.0575","v":{"$error":"#DIV/0!"}},{"$f":"U261/'Input Screen'!$C$8","v":{"$error":"#DIV/0!"}},{"$error":"#DIV/0!"},{"$error":"#DIV/0!"},{"$f":"U261*'Input Screen'!$C$21/1000000","v":{"$error":"#DIV/0!"}},25.600000000000094,{"$error":"#VALUE!"},{"$error":"#VALUE!"},null,null,null,null,null,null,null,null,null,null,null,null,null,null,null,null,{"$f":"'Input Screen'!$C$8*5280*$AU$4*'Input Screen'!$C$9*2*(T261-$T$6)/12*0.0575","v":{"$error":"#DIV/0!"}},{"$error":"#DIV/0!"},{"$f":"AS261/($AU$4*'Input Screen'!$C$8)","v":{"$error":"#DIV/0!"}},{"$error":"#DIV/0!"},{"$error":"#DIV/0!"},{"$f":"AS261*'Input Screen'!$C$21/1000000","v":{"$error":"#DIV/0!"}}]
[null,null,null,null,null,null,null,null,null,null,null,null,null,null,null,null,null,null,null,{"$error":"#DIV/0!"},{"$f":"'Input Screen'!$C$8*5280*'Input Screen'!$C$9*2*(T262-$T$6)/12*0.0575","v":{"$error":"#DIV/0!"}},{"$f":"U262/'Input Screen'!$C$8","v":{"$error":"#DIV/0!"}},{"$error":"#DIV/0!"},{"$error":"#DIV/0!"},{"$f":"U262*'Input Screen'!$C$21/1000000","v":{"$error":"#DIV/0!"}},25.700000000000095,{"$error":"#VALUE!"},{"$error":"#VALUE!"},null,null,null,null,null,null,null,null,null,null,null,null,null,null,null,null,{"$f":"'Input Screen'!$C$8*5280*$AU$4*'Input Screen'!$C$9*2*(T262-$T$6)/12*0.0575","v":{"$error":"#DIV/0!"}},{"$error":"#DIV/0!"},{"$f":"AS262/($AU$4*'Input Screen'!$C$8)","v":{"$error":"#DIV/0!"}},{"$error":"#DIV/0!"},{"$error":"#DIV/0!"},{"$f":"AS262*'Input Screen'!$C$21/1000000","v":{"$error":"#DIV/0!"}}]
[null,null,null,null,null,null,null,null,null,null,null,null,null,null,null,null,null,null,null,{"$error":"#DIV/0!"},{"$f":"'Input Screen'!$C$8*5280*'Input Screen'!$C$9*2*(T263-$T$6)/12*0.0575","v":{"$error":"#DIV/0!"}},{"$f":"U263/'Input Screen'!$C$8","v":{"$error":"#DIV/0!"}},{"$f":"1-(_xlfn.NORM.S.DIST((T263-$BA$6)/((MAX($T$6:$T$306)-$BA$6)/6),TRUE))","v":{"$error":"#DIV/0!"}},{"$f":"U263*$R$6/1000000","v":{"$error":"#DIV/0!"}},{"$f":"U263*'Input Screen'!$C$21/1000000","v":{"$error":"#DIV/0!"}},25.800000000000097,{"$f":"(_xlfn.WEIBULL.DIST(Z263,$M$6,$M$7,TRUE))","v":{"$error":"#VALUE!"}},{"$f":"1-AA263","v":{"$error":"#VALUE!"}},null,null,null,null,null,null,null,null,null,null,null,null,null,null,null,null,{"$f":"'Input Screen'!$C$8*5280*$AU$4*'Input Screen'!$C$9*2*(T263-$T$6)/12*0.0575","v":{"$error":"#DIV/0!"}},{"$error":"#DIV/0!"},{"$f":"AS263/($AU$4*'Input Screen'!$C$8)","v":{"$error":"#DIV/0!"}},{"$f":"1-(_xlfn.NORM.S.DIST((AT263-$BA$6)/((MAX($T$6:$T$306)-$BA$6)/6),TRUE))","v":{"$error":"#DIV/0!"}},{"$f":"AS263*$R$6/1000000","v":{"$error":"#DIV/0!"}},{"$f":"AS263*'Input Screen'!$C$21/1000000","v":{"$error":"#DIV/0!"}}]
[null,null,null,null,null,null,null,null,null,null,null,null,null,null,null,null,null,null,null,{"$f":"IF(T263>=5,5,T263+0.01)","v":{"$error":"#DIV/0!"}},{"$f":"'Input Screen'!$C$8*5280*'Input Screen'!$C$9*2*(T264-$T$6)/12*0.0575","v":{"$error":"#DIV/0!"}},{"$f":"U264/'Input Screen'!$C$8","v":{"$error":"#DIV/0!"}},{"$error":"#DIV/0!"},{"$error":"#DIV/0!"},{"$f":"U264*'Input Screen'!$C$21/1000000","v":{"$error":"#DIV/0!"}},{"$f":"Z263+0.1","v":25.900000000000098},{"$error":"#VALUE!"},{"$error":"#VALUE!"},null,null,null,null,null,null,null,null,null,null,null,null,null,null,null,null,{"$f":"'Input Screen'!$C$8*5280*$AU$4*'Input Screen'!$C$9*2*(T264-$T$6)/12*0.0575","v":{"$error":"#DIV/0!"}},{"$f":"IF(AT263>=5,5,AT263+0.01)","v":{"$error":"#DIV/0!"}},{"$f":"AS264/($AU$4*'Input Screen'!$C$8)","v":{"$error":"#DIV/0!"}},{"$error":"#DIV/0!"},{"$error":"#DIV/0!"},{"$f":"AS264*'Input Screen'!$C$21/1000000","v":{"$error":"#DIV/0!"}}]
[null,null,null,null,null,null,null,null,null,null,null,null,null,null,null,null,null,null,null,{"$error":"#DIV/0!"},{"$f":"'Input Screen'!$C$8*5280*'Input Screen'!$C$9*2*(T265-$T$6)/12*0.0575","v":{"$error":"#DIV/0!"}},{"$f":"U265/'Input Screen'!$C$8","v":{"$error":"#DIV/0!"}},{"$error":"#DIV/0!"},{"$error":"#DIV/0!"},{"$f":"U265*'Input Screen'!$C$21/1000000","v":{"$error":"#DIV/0!"}},26.000000000000099,{"$error":"#VALUE!"},{"$error":"#VALUE!"},null,null,null,null,null,null,null,null,null,null,null,null,null,null,null,null,{"$f":"'Input Screen'!$C$8*5280*$AU$4*'Input Screen'!$C$9*2*(T265-$T$6)/12*0.0575","v":{"$error":"#DIV/0!"}},{"$error":"#DIV/0!"},{"$f":"AS265/($AU$4*'Input Screen'!$C$8)","v":{"$error":"#DIV/0!"}},{"$error":"#DIV/0!"},{"$error":"#DIV/0!"},{"$f":"AS265*'Input Screen'!$C$21/1000000","v":{"$error":"#DIV/0!"}}]
[null,null,null,null,null,null,null,null,null,null,null,null,null,null,null,null,null,null,null,{"$error":"#DIV/0!"},{"$f":"'Input Screen'!$C$8*5280*'Input Screen'!$C$9*2*(T266-$T$6)/12*0.0575","v":{"$error":"#DIV/0!"}},{"$f":"U266/'Input Screen'!$C$8","v":{"$error":"#DIV/0!"}},{"$error":"#DIV/0!"},{"$error":"#DIV/0!"},{"$f":"U266*'Input Screen'!$C$21/1000000","v":{"$error":"#DIV/0!"}},26.100000000000101,{"$error":"#VALUE!"},{"$error":"#VALUE!"},null,null,null,null,null,null,null,null,null,null,null,null,null,null,null,null,{"$f":"'Input Screen'!$C$8*5280*$AU$4*'Input Screen'!$C$9*2*(T266-$T$6)/12*0.0575","v":{"$error":"#DIV/0!"}},{"$error":"#DIV/0!"},{"$f":"AS266/($AU$4*'Input Screen'!$C$8)","v":{"$error":"#DIV/0!"}},{"$error":"#DIV/0!"},{"$error":"#DIV/0!"},{"$f":"AS266*'Input Screen'!$C$21/1000000","v":{"$error":"#DIV/0!"}}]
[null,null,null,null,null,null,null,null,null,null,null,null,null,null,null,null,null,null,null,{"$error":"#DIV/0!"},{"$f":"'Input Screen'!$C$8*5280*'Input Screen'!$C$9*2*(T267-$T$6)/12*0.0575","v":{"$error":"#DIV/0!"}},{"$f":"U267/'Input Screen'!$C$8","v":{"$error":"#DIV/0!"}},{"$error":"#DIV/0!"},{"$error":"#DIV/0!"},{"$f":"U267*'Input Screen'!$C$21/1000000","v":{"$error":"#DIV/0!"}},26.200000000000102,{"$error":"#VALUE!"},{"$error":"#VALUE!"},null,null,null,null,null,null,null,null,null,null,null,null,null,null,null,null,{"$f":"'Input Screen'!$C$8*5280*$AU$4*'Input Screen'!$C$9*2*(T267-$T$6)/12*0.0575","v":{"$error":"#DIV/0!"}},{"$error":"#DIV/0!"},{"$f":"AS267/($AU$4*'Input Screen'!$C$8)","v":{"$error":"#DIV/0!"}},{"$error":"#DIV/0!"},{"$error":"#DIV/0!"},{"$f":"AS267*'Input Screen'!$C$21/1000000","v":{"$error":"#DIV/0!"}}]
[null,null,null,null,null,null,null,null,null,null,null,null,null,null,null,null,null,null,null,{"$error":"#DIV/0!"},{"$f":"'Input Screen'!$C$8*5280*'Input Screen'!$C$9*2*(T268-$T$6)/12*0.0575","v":{"$error":"#DIV/0!"}},{"$f":"U268/'Input Screen'!$C$8","v":{"$error":"#DIV/0!"}},{"$error":"#DIV/0!"},{"$error":"#DIV/0!"},{"$f":"U268*'Input Screen'!$C$21/1000000","v":{"$error":"#DIV/0!"}},26.300000000000104,{"$error":"#VALUE!"},{"$error":"#VALUE!"},null,null,null,null,null,null,null,null,null,null,null,null,null,null,null,null,{"$f":"'Input Screen'!$C$8*5280*$AU$4*'Input Screen'!$C$9*2*(T268-$T$6)/12*0.0575","v":{"$error":"#DIV/0!"}},{"$error":"#DIV/0!"},{"$f":"AS268/($AU$4*'Input Screen'!$C$8)","v":{"$error":"#DIV/0!"}},{"$error":"#DIV/0!"},{"$error":"#DIV/0!"},{"$f":"AS268*'Input Screen'!$C$21/1000000","v":{"$error":"#DIV/0!"}}]
[null,null,null,null,null,null,null,null,null,null,null,null,null,null,null,null,null,null,null,{"$error":"#DIV/0!"},{"$f":"'Input Screen'!$C$8*5280*'Input Screen'!$C$9*2*(T269-$T$6)/12*0.0575","v":{"$error":"#DIV/0!"}},{"$f":"U269/'Input Screen'!$C$8","v":{"$error":"#DIV/0!"}},{"$error":"#DIV/0!"},{"$error":"#DIV/0!"},{"$f":"U269*'Input Screen'!$C$21/1000000","v":{"$error":"#DIV/0!"}},26.400000000000105,{"$error":"#VALUE!"},{"$error":"#VALUE!"},null,null,null,null,null,null,null,null,null,null,null,null,null,null,null,null,{"$f":"'Input Screen'!$C$8*5280*$AU$4*'Input Screen'!$C$9*2*(T269-$T$6)/12*0.0575","v":{"$error":"#DIV/0!"}},{"$error":"#DIV/0!"},{"$f":"AS269/($AU$4*'Input Screen'!$C$8)","v":{"$error":"#DIV/0!"}},{"$error":"#DIV/0!"},{"$error":"#DIV/0!"},{"$f":"AS269*'Input Screen'!$C$21/1000000","v":{"$error":"#DIV/0!"}}]
[null,null,null,null,null,null,null,null,null,null,null,null,null,null,null,null,null,null,null,{"$error":"#DIV/0!"},{"$f":"'Input Screen'!$C$8*5280*'Input Screen'!$C$9*2*(T270-$T$6)/12*0.0575","v":{"$error":"#DIV/0!"}},{"$f":"U270/'Input Screen'!$C$8","v":{"$error":"#DIV/0!"}},{"$error":"#DIV/0!"},{"$error":"#DIV/0!"},{"$f":"U270*'Input Screen'!$C$21/1000000","v":{"$error":"#DIV/0!"}},26.500000000000107,{"$error":"#VALUE!"},{"$error":"#VALUE!"},null,null,null,null,null,null,null,null,null,null,null,null,null,null,null,null,{"$f":"'Input Screen'!$C$8*5280*$AU$4*'Input Screen'!$C$9*2*(T270-$T$6)/12*0.0575","v":{"$error":"#DIV/0!"}},{"$error":"#DIV/0!"},{"$f":"AS270/($AU$4*'Input Screen'!$C$8)","v":{"$error":"#DIV/0!"}},{"$error":"#DIV/0!"},{"$error":"#DIV/0!"},{"$f":"AS270*'Input Screen'!$C$21/1000000","v":{"$error":"#DIV/0!"}}]
[null,null,null,null,null,null,null,null,null,null,null,null,null,null,null,null,null,null,null,{"$error":"#DIV/0!"},{"$f":"'Input Screen'!$C$8*5280*'Input Screen'!$C$9*2*(T271-$T$6)/12*0.0575","v":{"$error":"#DIV/0!"}},{"$f":"U271/'Input Screen'!$C$8","v":{"$error":"#DIV/0!"}},{"$error":"#DIV/0!"},{"$error":"#DIV/0!"},{"$f":"U271*'Input Screen'!$C$21/1000000","v":{"$error":"#DIV/0!"}},26.600000000000108,{"$error":"#VALUE!"},{"$error":"#VALUE!"},null,null,null,null,null,null,null,null,null,null,null,null,null,null,null,null,{"$f":"'Input Screen'!$C$8*5280*$AU$4*'Input Screen'!$C$9*2*(T271-$T$6)/12*0.0575","v":{"$error":"#DIV/0!"}},{"$error":"#DIV/0!"},{"$f":"AS271/($AU$4*'Input Screen'!$C$8)","v":{"$error":"#DIV/0!"}},{"$error":"#DIV/0!"},{"$error":"#DIV/0!"},{"$f":"AS271*'Input Screen'!$C$21/1000000","v":{"$error":"#DIV/0!"}}]
[null,null,null,null,null,null,null,null,null,null,null,null,null,null,null,null,null,null,null,{"$error":"#DIV/0!"},{"$f":"'Input Screen'!$C$8*5280*'Input Screen'!$C$9*2*(T272-$T$6)/12*0.0575","v":{"$error":"#DIV/0!"}},{"$f":"U272/'Input Screen'!$C$8","v":{"$error":"#DIV/0!"}},{"$error":"#DIV/0!"},{"$error":"#DIV/0!"},{"$f":"U272*'Input Screen'!$C$21/1000000","v":{"$error":"#DIV/0!"}},26.700000000000109,{"$error":"#VALUE!"},{"$error":"#VALUE!"},null,null,null,null,null,null,null,null,null,null,null,null,null,null,null,null,{"$f":"'Input Screen'!$C$8*5280*$AU$4*'Input Screen'!$C$9*2*(T272-$T$6)/12*0.0575","v":{"$error":"#DIV/0!"}},{"$error":"#DIV/0!"},{"$f":"AS272/($AU$4*'Input Screen'!$C$8)","v":{"$error":"#DIV/0!"}},{"$error":"#DIV/0!"},{"$error":"#DIV/0!"},{"$f":"AS272*'Input Screen'!$C$21/1000000","v":{"$error":"#DIV/0!"}}]
[null,null,null,null,null,null,null,null,null,null,null,null,null,null,null,null,null,null,null,{"$error":"#DIV/0!"},{"$f":"'Input Screen'!$C$8*5280*'Input Screen'!$C$9*2*(T273-$T$6)/12*0.0575","v":{"$error":"#DIV/0!"}},{"$f":"U273/'Input Screen'!$C$8","v":{"$error":"#DIV/0!"}},{"$error":"#DIV/0!"},{"$error":"#DIV/0!"},{"$f":"U273*'Input Screen'!$C$21/1000000","v":{"$error":"#DIV/0!"}},26.800000000000111,{"$error":"#VALUE!"},{"$error":"#VALUE!"},null,null,null,null,null,null,null,null,null,null,null,null,null,null,null,null,{"$f":"'Input Screen'!$C$8*5280*$AU$4*'Input Screen'!$C$9*2*(T273-$T$6)/12*0.0575","v":{"$error":"#DIV/0!"}},{"$error":"#DIV/0!"},{"$f":"AS273/($AU$4*'Input Screen'!$C$8)","v":{"$error":"#DIV/0!"}},{"$error":"#DIV/0!"},{"$error":"#DIV/0!"},{"$f":"AS273*'Input Screen'!$C$21/1000000","v":{"$error":"#DIV/0!"}}]
[null,null,null,null,null,null,null,null,null,null,null,null,null,null,null,null,null,null,null,{"$error":"#DIV/0!"},{"$f":"'Input Screen'!$C$8*5280*'Input Screen'!$C$9*2*(T274-$T$6)/12*0.0575","v":{"$error":"#DIV/0!"}},{"$f":"U274/'Input Screen'!$C$8","v":{"$error":"#DIV/0!"}},{"$error":"#DIV/0!"},{"$error":"#DIV/0!"},{"$f":"U274*'Input Screen'!$C$21/1000000","v":{"$error":"#DIV/0!"}},26.900000000000112,{"$error":"#VALUE!"},{"$error":"#VALUE!"},null,null,null,null,null,null,null,null,null,null,null,null,null,null,null,null,{"$f":"'Input Screen'!$C$8*5280*$AU$4*'Input Screen'!$C$9*2*(T274-$T$6)/12*0.0575","v":{"$error":"#DIV/0!"}},{"$error":"#DIV/0!"},{"$f":"AS274/($AU$4*'Input Screen'!$C$8)","v":{"$error":"#DIV/0!"}},{"$error":"#DIV/0!"},{"$error":"#DIV/0!"},{"$f":"AS274*'Input Screen'!$C$21/1000000","v":{"$error":"#DIV/0!"}}]
[null,null,null,null,null,null,null,null,null,null,null,null,null,null,null,null,null,null,null,{"$error":"#DIV/0!"},{"$f":"'Input Screen'!$C$8*5280*'Input Screen'!$C$9*2*(T275-$T$6)/12*0.0575","v":{"$error":"#DIV/0!"}},{"$f":"U275/'Input Screen'!$C$8","v":{"$error":"#DIV/0!"}},{"$error":"#DIV/0!"},{"$error":"#DIV/0!"},{"$f":"U275*'Input Screen'!$C$21/1000000","v":{"$error":"#DIV/0!"}},27.000000000000114,{"$error":"#VALUE!"},{"$error":"#VALUE!"},null,null,null,null,null,null,null,null,null,null,null,null,null,null,null,null,{"$f":"'Input Screen'!$C$8*5280*$AU$4*'Input Screen'!$C$9*2*(T275-$T$6)/12*0.0575","v":{"$error":"#DIV/0!"}},{"$error":"#DIV/0!"},{"$f":"AS275/($AU$4*'Input Screen'!$C$8)","v":{"$error":"#DIV/0!"}},{"$error":"#DIV/0!"},{"$error":"#DIV/0!"},{"$f":"AS275*'Input Screen'!$C$21/1000000","v":{"$error":"#DIV/0!"}}]
[null,null,null,null,null,null,null,null,null,null,null,null,null,null,null,null,null,null,null,{"$error":"#DIV/0!"},{"$f":"'Input Screen'!$C$8*5280*'Input Screen'!$C$9*2*(T276-$T$6)/12*0.0575","v":{"$error":"#DIV/0!"}},{"$f":"U276/'Input Screen'!$C$8","v":{"$error":"#DIV/0!"}},{"$error":"#DIV/0!"},{"$error":"#DIV/0!"},{"$f":"U276*'Input Screen'!$C$21/1000000","v":{"$error":"#DIV/0!"}},27.100000000000115,{"$error":"#VALUE!"},{"$error":"#VALUE!"},null,null,null,null,null,null,null,null,null,null,null,null,null,null,null,null,{"$f":"'Input Screen'!$C$8*5280*$AU$4*'Input Screen'!$C$9*2*(T276-$T$6)/12*0.0575","v":{"$error":"#DIV/0!"}},{"$error":"#DIV/0!"},{"$f":"AS276/($AU$4*'Input Screen'!$C$8)","v":{"$error":"#DIV/0!"}},{"$error":"#DIV/0!"},{"$error":"#DIV/0!"},{"$f":"AS276*'Input Screen'!$C$21/1000000","v":{"$error":"#DIV/0!"}}]
[null,null,null,null,null,null,null,null,null,null,null,null,null,null,null,null,null,null,null,{"$error":"#DIV/0!"},{"$f":"'Input Screen'!$C$8*5280*'Input Screen'!$C$9*2*(T277-$T$6)/12*0.0575","v":{"$error":"#DIV/0!"}},{"$f":"U277/'Input Screen'!$C$8","v":{"$error":"#DIV/0!"}},{"$error":"#DIV/0!"},{"$error":"#DIV/0!"},{"$f":"U277*'Input Screen'!$C$21/1000000","v":{"$error":"#DIV/0!"}},27.200000000000117,{"$error":"#VALUE!"},{"$error":"#VALUE!"},null,null,null,null,null,null,null,null,null,null,null,null,null,null,null,null,{"$f":"'Input Screen'!$C$8*5280*$AU$4*'Input Screen'!$C$9*2*(T277-$T$6)/12*0.0575","v":{"$error":"#DIV/0!"}},{"$error":"#DIV/0!"},{"$f":"AS277/($AU$4*'Input Screen'!$C$8)","v":{"$error":"#DIV/0!"}},{"$error":"#DIV/0!"},{"$error":"#DIV/0!"},{"$f":"AS277*'Input Screen'!$C$21/1000000","v":{"$error":"#DIV/0!"}}]
[null,null,null,null,null,null,null,null,null,null,null,null,null,null,null,null,null,null,null,{"$error":"#DIV/0!"},{"$f":"'Input Screen'!$C$8*5280*'Input Screen'!$C$9*2*(T278-$T$6)/12*0.0575","v":{"$error":"#DIV/0!"}},{"$f":"U278/'Input Screen'!$C$8","v":{"$error":"#DIV/0!"}},{"$error":"#DIV/0!"},{"$error":"#DIV/0!"},{"$f":"U278*'Input Screen'!$C$21/1000000","v":{"$error":"#DIV/0!"}},27.300000000000118,{"$error":"#VALUE!"},{"$error":"#VALUE!"},null,null,null,null,null,null,null,null,null,null,null,null,null,null,null,null,{"$f":"'Input Screen'!$C$8*5280*$AU$4*'Input Screen'!$C$9*2*(T278-$T$6)/12*0.0575","v":{"$error":"#DIV/0!"}},{"$error":"#DIV/0!"},{"$f":"AS278/($AU$4*'Input Screen'!$C$8)","v":{"$error":"#DIV/0!"}},{"$error":"#DIV/0!"},{"$error":"#DIV/0!"},{"$f":"AS278*'Input Screen'!$C$21/1000000","v":{"$error":"#DIV/0!"}}]
[null,null,null,null,null,null,null,null,null,null,null,null,null,null,null,null,null,null,null,{"$error":"#DIV/0!"},{"$f":"'Input Screen'!$C$8*5280*'Input Screen'!$C$9*2*(T279-$T$6)/12*0.0575","v":{"$error":"#DIV/0!"}},{"$f":"U279/'Input Screen'!$C$8","v":{"$error":"#DIV/0!"}},{"$error":"#DIV/0!"},{"$error":"#DIV/0!"},{"$f":"U279*'Input Screen'!$C$21/1000000","v":{"$error":"#DIV/0!"}},27.400000000000119,{"$error":"#VALUE!"},{"$error":"#VALUE!"},null,null,null,null,null,null,null,null,null,null,null,null,null,null,null,null,{"$f":"'Input Screen'!$C$8*5280*$AU$4*'Input Screen'!$C$9*2*(T279-$T$6)/12*0.0575","v":{"$error":"#DIV/0!"}},{"$error":"#DIV/0!"},{"$f":"AS279/($AU$4*'Input Screen'!$C$8)","v":{"$error":"#DIV/0!"}},{"$error":"#DIV/0!"},{"$error":"#DIV/0!"},{"$f":"AS279*'Input Screen'!$C$21/1000000","v":{"$error":"#DIV/0!"}}]
[null,null,null,null,null,null,null,null,null,null,null,null,null,null,null,null,null,null,null,{"$error":"#DIV/0!"},{"$f":"'Input Screen'!$C$8*5280*'Input Screen'!$C$9*2*(T280-$T$6)/12*0.0575","v":{"$error":"#DIV/0!"}},{"$f":"U280/'Input Screen'!$C$8","v":{"$error":"#DIV/0!"}},{"$error":"#DIV/0!"},{"$error":"#DIV/0!"},{"$f":"U280*'Input Screen'!$C$21/1000000","v":{"$error":"#DIV/0!"}},27.500000000000121,{"$error":"#VALUE!"},{"$error":"#VALUE!"},null,null,null,null,null,null,null,null,null,null,null,null,null,null,null,null,{"$f":"'Input Screen'!$C$8*5280*$AU$4*'Input Screen'!$C$9*2*(T280-$T$6)/12*0.0575","v":{"$error":"#DIV/0!"}},{"$error":"#DIV/0!"},{"$f":"AS280/($AU$4*'Input Screen'!$C$8)","v":{"$error":"#DIV/0!"}},{"$error":"#DIV/0!"},{"$error":"#DIV/0!"},{"$f":"AS280*'Input Screen'!$C$21/1000000","v":{"$error":"#DIV/0!"}}]
[null,null,null,null,null,null,null,null,null,null,null,null,null,null,null,null,null,null,null,{"$error":"#DIV/0!"},{"$f":"'Input Screen'!$C$8*5280*'Input Screen'!$C$9*2*(T281-$T$6)/12*0.0575","v":{"$error":"#DIV/0!"}},{"$f":"U281/'Input Screen'!$C$8","v":{"$error":"#DIV/0!"}},{"$error":"#DIV/0!"},{"$error":"#DIV/0!"},{"$f":"U281*'Input Screen'!$C$21/1000000","v":{"$error":"#DIV/0!"}},27.600000000000122,{"$error":"#VALUE!"},{"$error":"#VALUE!"},null,null,null,null,null,null,null,null,null,null,null,null,null,null,null,null,{"$f":"'Input Screen'!$C$8*5280*$AU$4*'Input Screen'!$C$9*2*(T281-$T$6)/12*0.0575","v":{"$error":"#DIV/0!"}},{"$error":"#DIV/0!"},{"$f":"AS281/($AU$4*'Input Screen'!$C$8)","v":{"$error":"#DIV/0!"}},{"$error":"#DIV/0!"},{"$error":"#DIV/0!"},{"$f":"AS281*'Input Screen'!$C$21/1000000","v":{"$error":"#DIV/0!"}}]
[null,null,null,null,null,null,null,null,null,null,null,null,null,null,null,null,null,null,null,{"$error":"#DIV/0!"},{"$f":"'Input Screen'!$C$8*5280*'Input Screen'!$C$9*2*(T282-$T$6)/12*0.0575","v":{"$error":"#DIV/0!"}},{"$f":"U282/'Input Screen'!$C$8","v":{"$error":"#DIV/0!"}},{"$error":"#DIV/0!"},{"$error":"#DIV/0!"},{"$f":"U282*'Input Screen'!$C$21/1000000","v":{"$error":"#DIV/0!"}},27.700000000000124,{"$error":"#VALUE!"},{"$error":"#VALUE!"},null,null,null,null,null,null,null,null,null,null,null,null,null,null,null,null,{"$f":"'Input Screen'!$C$8*5280*$AU$4*'Input Screen'!$C$9*2*(T282-$T$6)/12*0.0575","v":{"$error":"#DIV/0!"}},{"$error":"#DIV/0!"},{"$f":"AS282/($AU$4*'Input Screen'!$C$8)","v":{"$error":"#DIV/0!"}},{"$error":"#DIV/0!"},{"$error":"#DIV/0!"},{"$f":"AS282*'Input Screen'!$C$21/1000000","v":{"$error":"#DIV/0!"}}]
[null,null,null,null,null,null,null,null,null,null,null,null,null,null,null,null,null,null,null,{"$error":"#DIV/0!"},{"$f":"'Input Screen'!$C$8*5280*'Input Screen'!$C$9*2*(T283-$T$6)/12*0.0575","v":{"$error":"#DIV/0!"}},{"$f":"U283/'Input Screen'!$C$8","v":{"$error":"#DIV/0!"}},{"$error":"#DIV/0!"},{"$error":"#DIV/0!"},{"$f":"U283*'Input Screen'!$C$21/1000000","v":{"$error":"#DIV/0!"}},27.800000000000125,{"$error":"#VALUE!"},{"$error":"#VALUE!"},null,null,null,null,null,null,null,null,null,null,null,null,null,null,null,null,{"$f":"'Input Screen'!$C$8*5280*$AU$4*'Input Screen'!$C$9*2*(T283-$T$6)/12*0.0575","v":{"$error":"#DIV/0!"}},{"$error":"#DIV/0!"},{"$f":"AS283/($AU$4*'Input Screen'!$C$8)","v":{"$error":"#DIV/0!"}},{"$error":"#DIV/0!"},{"$error":"#DIV/0!"},{"$f":"AS283*'Input Screen'!$C$21/1000000","v":{"$error":"#DIV/0!"}}]
[null,null,null,null,null,null,null,null,null,null,null,null,null,null,null,null,null,null,null,{"$error":"#DIV/0!"},{"$f":"'Input Screen'!$C$8*5280*'Input Screen'!$C$9*2*(T284-$T$6)/12*0.0575","v":{"$error":"#DIV/0!"}},{"$f":"U284/'Input Screen'!$C$8","v":{"$error":"#DIV/0!"}},{"$error":"#DIV/0!"},{"$error":"#DIV/0!"},{"$f":"U284*'Input Screen'!$C$21/1000000","v":{"$error":"#DIV/0!"}},27.900000000000126,{"$error":"#VALUE!"},{"$error":"#VALUE!"},null,null,null,null,null,null,null,null,null,null,null,null,null,null,null,null,{"$f":"'Input Screen'!$C$8*5280*$AU$4*'Input Screen'!$C$9*2*(T284-$T$6)/12*0.0575","v":{"$error":"#DIV/0!"}},{"$error":"#DIV/0!"},{"$f":"AS284/($AU$4*'Input Screen'!$C$8)","v":{"$error":"#DIV/0!"}},{"$error":"#DIV/0!"},{"$error":"#DIV/0!"},{"$f":"AS284*'Input Screen'!$C$21/1000000","v":{"$error":"#DIV/0!"}}]
[null,null,null,null,null,null,null,null,null,null,null,null,null,null,null,null,null,null,null,{"$error":"#DIV/0!"},{"$f":"'Input Screen'!$C$8*5280*'Input Screen'!$C$9*2*(T285-$T$6)/12*0.0575","v":{"$error":"#DIV/0!"}},{"$f":"U285/'Input Screen'!$C$8","v":{"$error":"#DIV/0!"}},{"$error":"#DIV/0!"},{"$error":"#DIV/0!"},{"$f":"U285*'Input Screen'!$C$21/1000000","v":{"$error":"#DIV/0!"}},28.000000000000128,{"$error":"#VALUE!"},{"$error":"#VALUE!"},null,null,null,null,null,null,null,null,null,null,null,null,null,null,null,null,{"$f":"'Input Screen'!$C$8*5280*$AU$4*'Input Screen'!$C$9*2*(T285-$T$6)/12*0.0575","v":{"$error":"#DIV/0!"}},{"$error":"#DIV/0!"},{"$f":"AS285/($AU$4*'Input Screen'!$C$8)","v":{"$error":"#DIV/0!"}},{"$error":"#DIV/0!"},{"$error":"#DIV/0!"},{"$f":"AS285*'Input Screen'!$C$21/1000000","v":{"$error":"#DIV/0!"}}]
[null,null,null,null,null,null,null,null,null,null,null,null,null,null,null,null,null,null,null,{"$error":"#DIV/0!"},{"$f":"'Input Screen'!$C$8*5280*'Input Screen'!$C$9*2*(T286-$T$6)/12*0.0575","v":{"$error":"#DIV/0!"}},{"$f":"U286/'Input Screen'!$C$8","v":{"$error":"#DIV/0!"}},{"$error":"#DIV/0!"},{"$error":"#DIV/0!"},{"$f":"U286*'Input Screen'!$C$21/1000000","v":{"$error":"#DIV/0!"}},28.100000000000129,{"$error":"#VALUE!"},{"$error":"#VALUE!"},null,null,null,null,null,null,null,null,null,null,null,null,null,null,null,null,{"$f":"'Input Screen'!$C$8*5280*$AU$4*'Input Screen'!$C$9*2*(T286-$T$6)/12*0.0575","v":{"$error":"#DIV/0!"}},{"$error":"#DIV/0!"},{"$f":"AS286/($AU$4*'Input Screen'!$C$8)","v":{"$error":"#DIV/0!"}},{"$error":"#DIV/0!"},{"$error":"#DIV/0!"},{"$f":"AS286*'Input Screen'!$C$21/1000000","v":{"$error":"#DIV/0!"}}]
[null,null,null,null,null,null,null,null,null,null,null,null,null,null,null,null,null,null,null,{"$error":"#DIV/0!"},{"$f":"'Input Screen'!$C$8*5280*'Input Screen'!$C$9*2*(T287-$T$6)/12*0.0575","v":{"$error":"#DIV/0!"}},{"$f":"U287/'Input Screen'!$C$8","v":{"$error":"#DIV/0!"}},{"$error":"#DIV/0!"},{"$error":"#DIV/0!"},{"$f":"U287*'Input Screen'!$C$21/1000000","v":{"$error":"#DIV/0!"}},28.200000000000131,{"$error":"#VALUE!"},{"$error":"#VALUE!"},null,null,null,null,null,null,null,null,null,null,null,null,null,null,null,null,{"$f":"'Input Screen'!$C$8*5280*$AU$4*'Input Screen'!$C$9*2*(T287-$T$6)/12*0.0575","v":{"$error":"#DIV/0!"}},{"$error":"#DIV/0!"},{"$f":"AS287/($AU$4*'Input Screen'!$C$8)","v":{"$error":"#DIV/0!"}},{"$error":"#DIV/0!"},{"$error":"#DIV/0!"},{"$f":"AS287*'Input Screen'!$C$21/1000000","v":{"$error":"#DIV/0!"}}]
[null,null,null,null,null,null,null,null,null,null,null,null,null,null,null,null,null,null,null,{"$error":"#DIV/0!"},{"$f":"'Input Screen'!$C$8*5280*'Input Screen'!$C$9*2*(T288-$T$6)/12*0.0575","v":{"$error":"#DIV/0!"}},{"$f":"U288/'Input Screen'!$C$8","v":{"$error":"#DIV/0!"}},{"$error":"#DIV/0!"},{"$error":"#DIV/0!"},{"$f":"U288*'Input Screen'!$C$21/1000000","v":{"$error":"#DIV/0!"}},28.300000000000132,{"$error":"#VALUE!"},{"$error":"#VALUE!"},null,null,null,null,null,null,null,null,null,null,null,null,null,null,null,null,{"$f":"'Input Screen'!$C$8*5280*$AU$4*'Input Screen'!$C$9*2*(T288-$T$6)/12*0.0575","v":{"$error":"#DIV/0!"}},{"$error":"#DIV/0!"},{"$f":"AS288/($AU$4*'Input Screen'!$C$8)","v":{"$error":"#DIV/0!"}},{"$error":"#DIV/0!"},{"$error":"#DIV/0!"},{"$f":"AS288*'Input Screen'!$C$21/1000000","v":{"$error":"#DIV/0!"}}]
[null,null,null,null,null,null,null,null,null,null,null,null,null,null,null,null,null,null,null,{"$error":"#DIV/0!"},{"$f":"'Input Screen'!$C$8*5280*'Input Screen'!$C$9*2*(T289-$T$6)/12*0.0575","v":{"$error":"#DIV/0!"}},{"$f":"U289/'Input Screen'!$C$8","v":{"$error":"#DIV/0!"}},{"$error":"#DIV/0!"},{"$error":"#DIV/0!"},{"$f":"U289*'Input Screen'!$C$21/1000000","v":{"$error":"#DIV/0!"}},28.400000000000134,{"$error":"#VALUE!"},{"$error":"#VALUE!"},null,null,null,null,null,null,null,null,null,null,null,null,null,null,null,null,{"$f":"'Input Screen'!$C$8*5280*$AU$4*'Input Screen'!$C$9*2*(T289-$T$6)/12*0.0575","v":{"$error":"#DIV/0!"}},{"$error":"#DIV/0!"},{"$f":"AS289/($AU$4*'Input Screen'!$C$8)","v":{"$error":"#DIV/0!"}},{"$error":"#DIV/0!"},{"$error":"#DIV/0!"},{"$f":"AS289*'Input Screen'!$C$21/1000000","v":{"$error":"#DIV/0!"}}]
[null,null,null,null,null,null,null,null,null,null,null,null,null,null,null,null,null,null,null,{"$error":"#DIV/0!"},{"$f":"'Input Screen'!$C$8*5280*'Input Screen'!$C$9*2*(T290-$T$6)/12*0.0575","v":{"$error":"#DIV/0!"}},{"$f":"U290/'Input Screen'!$C$8","v":{"$error":"#DIV/0!"}},{"$error":"#DIV/0!"},{"$error":"#DIV/0!"},{"$f":"U290*'Input Screen'!$C$21/1000000","v":{"$error":"#DIV/0!"}},28.500000000000135,{"$error":"#VALUE!"},{"$error":"#VALUE!"},null,null,null,null,null,null,null,null,null,null,null,null,null,null,null,null,{"$f":"'Input Screen'!$C$8*5280*$AU$4*'Input Screen'!$C$9*2*(T290-$T$6)/12*0.0575","v":{"$error":"#DIV/0!"}},{"$error":"#DIV/0!"},{"$f":"AS290/($AU$4*'Input Screen'!$C$8)","v":{"$error":"#DIV/0!"}},{"$error":"#DIV/0!"},{"$error":"#DIV/0!"},{"$f":"AS290*'Input Screen'!$C$21/1000000","v":{"$error":"#DIV/0!"}}]
[null,null,null,null,null,null,null,null,null,null,null,null,null,null,null,null,null,null,null,{"$error":"#DIV/0!"},{"$f":"'Input Screen'!$C$8*5280*'Input Screen'!$C$9*2*(T291-$T$6)/12*0.0575","v":{"$error":"#DIV/0!"}},{"$f":"U291/'Input Screen'!$C$8","v":{"$error":"#DIV/0!"}},{"$error":"#DIV/0!"},{"$error":"#DIV/0!"},{"$f":"U291*'Input Screen'!$C$21/1000000","v":{"$error":"#DIV/0!"}},28.600000000000136,{"$error":"#VALUE!"},{"$error":"#VALUE!"},null,null,null,null,null,null,null,null,null,null,null,null,null,null,null,null,{"$f":"'Input Screen'!$C$8*5280*$AU$4*'Input Screen'!$C$9*2*(T291-$T$6)/12*0.0575","v":{"$error":"#DIV/0!"}},{"$error":"#DIV/0!"},{"$f":"AS291/($AU$4*'Input Screen'!$C$8)","v":{"$error":"#DIV/0!"}},{"$error":"#DIV/0!"},{"$error":"#DIV/0!"},{"$f":"AS291*'Input Screen'!$C$21/1000000","v":{"$error":"#DIV/0!"}}]
[null,null,null,null,null,null,null,null,null,null,null,null,null,null,null,null,null,null,null,{"$error":"#DIV/0!"},{"$f":"'Input Screen'!$C$8*5280*'Input Screen'!$C$9*2*(T292-$T$6)/12*0.0575","v":{"$error":"#DIV/0!"}},{"$f":"U292/'Input Screen'!$C$8","v":{"$error":"#DIV/0!"}},{"$error":"#DIV/0!"},{"$error":"#DIV/0!"},{"$f":"U292*'Input Screen'!$C$21/1000000","v":{"$error":"#DIV/0!"}},28.700000000000138,{"$error":"#VALUE!"},{"$error":"#VALUE!"},null,null,null,null,null,null,null,null,null,null,null,null,null,null,null,null,{"$f":"'Input Screen'!$C$8*5280*$AU$4*'Input Screen'!$C$9*2*(T292-$T$6)/12*0.0575","v":{"$error":"#DIV/0!"}},{"$error":"#DIV/0!"},{"$f":"AS292/($AU$4*'Input Screen'!$C$8)","v":{"$error":"#DIV/0!"}},{"$error":"#DIV/0!"},{"$error":"#DIV/0!"},{"$f":"AS292*'Input Screen'!$C$21/1000000","v":{"$error":"#DIV/0!"}}]
[null,null,null,null,null,null,null,null,null,null,null,null,null,null,null,null,null,null,null,{"$error":"#DIV/0!"},{"$f":"'Input Screen'!$C$8*5280*'Input Screen'!$C$9*2*(T293-$T$6)/12*0.0575","v":{"$error":"#DIV/0!"}},{"$f":"U293/'Input Screen'!$C$8","v":{"$error":"#DIV/0!"}},{"$error":"#DIV/0!"},{"$error":"#DIV/0!"},{"$f":"U293*'Input Screen'!$C$21/1000000","v":{"$error":"#DIV/0!"}},28.800000000000139,{"$error":"#VALUE!"},{"$error":"#VALUE!"},null,null,null,null,null,null,null,null,null,null,null,null,null,null,null,null,{"$f":"'Input Screen'!$C$8*5280*$AU$4*'Input Screen'!$C$9*2*(T293-$T$6)/12*0.0575","v":{"$error":"#DIV/0!"}},{"$error":"#DIV/0!"},{"$f":"AS293/($AU$4*'Input Screen'!$C$8)","v":{"$error":"#DIV/0!"}},{"$error":"#DIV/0!"},{"$error":"#DIV/0!"},{"$f":"AS293*'Input Screen'!$C$21/1000000","v":{"$error":"#DIV/0!"}}]
[null,null,null,null,null,null,null,null,null,null,null,null,null,null,null,null,null,null,null,{"$error":"#DIV/0!"},{"$f":"'Input Screen'!$C$8*5280*'Input Screen'!$C$9*2*(T294-$T$6)/12*0.0575","v":{"$error":"#DIV/0!"}},{"$f":"U294/'Input Screen'!$C$8","v":{"$error":"#DIV/0!"}},{"$error":"#DIV/0!"},{"$error":"#DIV/0!"},{"$f":"U294*'Input Screen'!$C$21/1000000","v":{"$error":"#DIV/0!"}},28.900000000000141,{"$error":"#VALUE!"},{"$error":"#VALUE!"},null,null,null,null,null,null,null,null,null,null,null,null,null,null,null,null,{"$f":"'Input Screen'!$C$8*5280*$AU$4*'Input Screen'!$C$9*2*(T294-$T$6)/12*0.0575","v":{"$error":"#DIV/0!"}},{"$error":"#DIV/0!"},{"$f":"AS294/($AU$4*'Input Screen'!$C$8)","v":{"$error":"#DIV/0!"}},{"$error":"#DIV/0!"},{"$error":"#DIV/0!"},{"$f":"AS294*'Input Screen'!$C$21/1000000","v":{"$error":"#DIV/0!"}}]
[null,null,null,null,null,null,null,null,null,null,null,null,null,null,null,null,null,null,null,{"$error":"#DIV/0!"},{"$f":"'Input Screen'!$C$8*5280*'Input Screen'!$C$9*2*(T295-$T$6)/12*0.0575","v":{"$error":"#DIV/0!"}},{"$f":"U295/'Input Screen'!$C$8","v":{"$error":"#DIV/0!"}},{"$error":"#DIV/0!"},{"$error":"#DIV/0!"},{"$f":"U295*'Input Screen'!$C$21/1000000","v":{"$error":"#DIV/0!"}},29.000000000000142,{"$error":"#VALUE!"},{"$error":"#VALUE!"},null,null,null,null,null,null,null,null,null,null,null,null,null,null,null,null,{"$f":"'Input Screen'!$C$8*5280*$AU$4*'Input Screen'!$C$9*2*(T295-$T$6)/12*0.0575","v":{"$error":"#DIV/0!"}},{"$error":"#DIV/0!"},{"$f":"AS295/($AU$4*'Input Screen'!$C$8)","v":{"$error":"#DIV/0!"}},{"$error":"#DIV/0!"},{"$error":"#DIV/0!"},{"$f":"AS295*'Input Screen'!$C$21/1000000","v":{"$error":"#DIV/0!"}}]
[null,null,null,null,null,null,null,null,null,null,null,null,null,null,null,null,null,null,null,{"$error":"#DIV/0!"},{"$f":"'Input Screen'!$C$8*5280*'Input Screen'!$C$9*2*(T296-$T$6)/12*0.0575","v":{"$error":"#DIV/0!"}},{"$f":"U296/'Input Screen'!$C$8","v":{"$error":"#DIV/0!"}},{"$error":"#DIV/0!"},{"$error":"#DIV/0!"},{"$f":"U296*'Input Screen'!$C$21/1000000","v":{"$error":"#DIV/0!"}},29.100000000000144,{"$error":"#VALUE!"},{"$error":"#VALUE!"},null,null,null,null,null,null,null,null,null,null,null,null,null,null,null,null,{"$f":"'Input Screen'!$C$8*5280*$AU$4*'Input Screen'!$C$9*2*(T296-$T$6)/12*0.0575","v":{"$error":"#DIV/0!"}},{"$error":"#DIV/0!"},{"$f":"AS296/($AU$4*'Input Screen'!$C$8)","v":{"$error":"#DIV/0!"}},{"$error":"#DIV/0!"},{"$error":"#DIV/0!"},{"$f":"AS296*'Input Screen'!$C$21/1000000","v":{"$error":"#DIV/0!"}}]
[null,null,null,null,null,null,null,null,null,null,null,null,null,null,null,null,null,null,null,{"$error":"#DIV/0!"},{"$f":"'Input Screen'!$C$8*5280*'Input Screen'!$C$9*2*(T297-$T$6)/12*0.0575","v":{"$error":"#DIV/0!"}},{"$f":"U297/'Input Screen'!$C$8","v":{"$error":"#DIV/0!"}},{"$error":"#DIV/0!"},{"$error":"#DIV/0!"},{"$f":"U297*'Input Screen'!$C$21/1000000","v":{"$error":"#DIV/0!"}},29.200000000000145,{"$error":"#VALUE!"},{"$error":"#VALUE!"},null,null,null,null,null,null,null,null,null,null,null,null,null,null,null,null,{"$f":"'Input Screen'!$C$8*5280*$AU$4*'Input Screen'!$C$9*2*(T297-$T$6)/12*0.0575","v":{"$error":"#DIV/0!"}},{"$error":"#DIV/0!"},{"$f":"AS297/($AU$4*'Input Screen'!$C$8)","v":{"$error":"#DIV/0!"}},{"$error":"#DIV/0!"},{"$error":"#DIV/0!"},{"$f":"AS297*'Input Screen'!$C$21/1000000","v":{"$error":"#DIV/0!"}}]
[null,null,null,null,null,null,null,null,null,null,null,null,null,null,null,null,null,null,null,{"$error":"#DIV/0!"},{"$f":"'Input Screen'!$C$8*5280*'Input Screen'!$C$9*2*(T298-$T$6)/12*0.0575","v":{"$error":"#DIV/0!"}},{"$f":"U298/'Input Screen'!$C$8","v":{"$error":"#DIV/0!"}},{"$error":"#DIV/0!"},{"$error":"#DIV/0!"},{"$f":"U298*'Input Screen'!$C$21/1000000","v":{"$error":"#DIV/0!"}},29.300000000000146,{"$error":"#VALUE!"},{"$error":"#VALUE!"},null,null,null,null,null,null,null,null,null,null,null,null,null,null,null,null,{"$f":"'Input Screen'!$C$8*5280*$AU$4*'Input Screen'!$C$9*2*(T298-$T$6)/12*0.0575","v":{"$error":"#DIV/0!"}},{"$error":"#DIV/0!"},{"$f":"AS298/($AU$4*'Input Screen'!$C$8)","v":{"$error":"#DIV/0!"}},{"$error":"#DIV/0!"},{"$error":"#DIV/0!"},{"$f":"AS298*'Input Screen'!$C$21/1000000","v":{"$error":"#DIV/0!"}}]
[null,null,null,null,null,null,null,null,null,null,null,null,null,null,null,null,null,null,null,{"$error":"#DIV/0!"},{"$f":"'Input Screen'!$C$8*5280*'Input Screen'!$C$9*2*(T299-$T$6)/12*0.0575","v":{"$error":"#DIV/0!"}},{"$f":"U299/'Input Screen'!$C$8","v":{"$error":"#DIV/0!"}},{"$error":"#DIV/0!"},{"$error":"#DIV/0!"},{"$f":"U299*'Input Screen'!$C$21/1000000","v":{"$error":"#DIV/0!"}},29.400000000000148,{"$error":"#VALUE!"},{"$error":"#VALUE!"},null,null,null,null,null,null,null,null,null,null,null,null,null,null,null,null,{"$f":"'Input Screen'!$C$8*5280*$AU$4*'Input Screen'!$C$9*2*(T299-$T$6)/12*0.0575","v":{"$error":"#DIV/0!"}},{"$error":"#DIV/0!"},{"$f":"AS299/($AU$4*'Input Screen'!$C$8)","v":{"$error":"#DIV/0!"}},{"$error":"#DIV/0!"},{"$error":"#DIV/0!"},{"$f":"AS299*'Input Screen'!$C$21/1000000","v":{"$error":"#DIV/0!"}}]
[null,null,null,null,null,null,null,null,null,null,null,null,null,null,null,null,null,null,null,{"$error":"#DIV/0!"},{"$f":"'Input Screen'!$C$8*5280*'Input Screen'!$C$9*2*(T300-$T$6)/12*0.0575","v":{"$error":"#DIV/0!"}},{"$f":"U300/'Input Screen'!$C$8","v":{"$error":"#DIV/0!"}},{"$error":"#DIV/0!"},{"$error":"#DIV/0!"},{"$f":"U300*'Input Screen'!$C$21/1000000","v":{"$error":"#DIV/0!"}},29.500000000000149,{"$error":"#VALUE!"},{"$error":"#VALUE!"},null,null,null,null,null,null,null,null,null,null,null,null,null,null,null,null,{"$f":"'Input Screen'!$C$8*5280*$AU$4*'Input Screen'!$C$9*2*(T300-$T$6)/12*0.0575","v":{"$error":"#DIV/0!"}},{"$error":"#DIV/0!"},{"$f":"AS300/($AU$4*'Input Screen'!$C$8)","v":{"$error":"#DIV/0!"}},{"$error":"#DIV/0!"},{"$error":"#DIV/0!"},{"$f":"AS300*'Input Screen'!$C$21/1000000","v":{"$error":"#DIV/0!"}}]
[null,null,null,null,null,null,null,null,null,null,null,null,null,null,null,null,null,null,null,{"$error":"#DIV/0!"},{"$f":"'Input Screen'!$C$8*5280*'Input Screen'!$C$9*2*(T301-$T$6)/12*0.0575","v":{"$error":"#DIV/0!"}},{"$f":"U301/'Input Screen'!$C$8","v":{"$error":"#DIV/0!"}},{"$error":"#DIV/0!"},{"$error":"#DIV/0!"},{"$f":"U301*'Input Screen'!$C$21/1000000","v":{"$error":"#DIV/0!"}},29.600000000000151,{"$error":"#VALUE!"},{"$error":"#VALUE!"},null,null,null,null,null,null,null,null,null,null,null,null,null,null,null,null,{"$f":"'Input Screen'!$C$8*5280*$AU$4*'Input Screen'!$C$9*2*(T301-$T$6)/12*0.0575","v":{"$error":"#DIV/0!"}},{"$error":"#DIV/0!"},{"$f":"AS301/($AU$4*'Input Screen'!$C$8)","v":{"$error":"#DIV/0!"}},{"$error":"#DIV/0!"},{"$error":"#DIV/0!"},{"$f":"AS301*'Input Screen'!$C$21/1000000","v":{"$error":"#DIV/0!"}}]
[null,null,null,null,null,null,null,null,null,null,null,null,null,null,null,null,null,null,null,{"$error":"#DIV/0!"},{"$f":"'Input Screen'!$C$8*5280*'Input Screen'!$C$9*2*(T302-$T$6)/12*0.0575","v":{"$error":"#DIV/0!"}},{"$f":"U302/'Input Screen'!$C$8","v":{"$error":"#DIV/0!"}},{"$error":"#DIV/0!"},{"$error":"#DIV/0!"},{"$f":"U302*'Input Screen'!$C$21/1000000","v":{"$error":"#DIV/0!"}},29.700000000000152,{"$error":"#VALUE!"},{"$error":"#VALUE!"},null,null,null,null,null,null,null,null,null,null,null,null,null,null,null,null,{"$f":"'Input Screen'!$C$8*5280*$AU$4*'Input Screen'!$C$9*2*(T302-$T$6)/12*0.0575","v":{"$error":"#DIV/0!"}},{"$error":"#DIV/0!"},{"$f":"AS302/($AU$4*'Input Screen'!$C$8)","v":{"$error":"#DIV/0!"}},{"$error":"#DIV/0!"},{"$error":"#DIV/0!"},{"$f":"AS302*'Input Screen'!$C$21/1000000","v":{"$error":"#DIV/0!"}}]
[null,null,null,null,null,null,null,null,null,null,null,null,null,null,null,null,null,null,null,{"$error":"#DIV/0!"},{"$f":"'Input Screen'!$C$8*5280*'Input Screen'!$C$9*2*(T303-$T$6)/12*0.0575","v":{"$error":"#DIV/0!"}},{"$f":"U303/'Input Screen'!$C$8","v":{"$error":"#DIV/0!"}},{"$error":"#DIV/0!"},{"$error":"#DIV/0!"},{"$f":"U303*'Input Screen'!$C$21/1000000","v":{"$error":"#DIV/0!"}},29.800000000000153,{"$error":"#VALUE!"},{"$error":"#VALUE!"},null,null,null,null,null,null,null,null,null,null,null,null,null,null,null,null,{"$f":"'Input Screen'!$C$8*5280*$AU$4*'Input Screen'!$C$9*2*(T303-$T$6)/12*0.0575","v":{"$error":"#DIV/0!"}},{"$error":"#DIV/0!"},{"$f":"AS303/($AU$4*'Input Screen'!$C$8)","v":{"$error":"#DIV/0!"}},{"$error":"#DIV/0!"},{"$error":"#DIV/0!"},{"$f":"AS303*'Input Screen'!$C$21/1000000","v":{"$error":"#DIV/0!"}}]
[null,null,null,null,null,null,null,null,null,null,null,null,null,null,null,null,null,null,null,{"$error":"#DIV/0!"},{"$f":"'Input Screen'!$C$8*5280*'Input Screen'!$C$9*2*(T304-$T$6)/12*0.0575","v":{"$error":"#DIV/0!"}},{"$f":"U304/'Input Screen'!$C$8","v":{"$error":"#DIV/0!"}},{"$error":"#DIV/0!"},{"$error":"#DIV/0!"},{"$f":"U304*'Input Screen'!$C$21/1000000","v":{"$error":"#DIV/0!"}},29.900000000000155,{"$error":"#VALUE!"},{"$error":"#VALUE!"},null,null,null,null,null,null,null,null,null,null,null,null,null,null,null,null,{"$f":"'Input Screen'!$C$8*5280*$AU$4*'Input Screen'!$C$9*2*(T304-$T$6)/12*0.0575","v":{"$error":"#DIV/0!"}},{"$error":"#DIV/0!"},{"$f":"AS304/($AU$4*'Input Screen'!$C$8)","v":{"$error":"#DIV/0!"}},{"$error":"#DIV/0!"},{"$error":"#DIV/0!"},{"$f":"AS304*'Input Screen'!$C$21/1000000","v":{"$error":"#DIV/0!"}}]
[null,null,null,null,null,null,null,null,null,null,null,null,null,null,null,null,null,null,null,{"$error":"#DIV/0!"},{"$f":"'Input Screen'!$C$8*5280*'Input Screen'!$C$9*2*(T305-$T$6)/12*0.0575","v":{"$error":"#DIV/0!"}},{"$f":"U305/'Input Screen'!$C$8","v":{"$error":"#DIV/0!"}},{"$error":"#DIV/0!"},{"$error":"#DIV/0!"},{"$f":"U305*'Input Screen'!$C$21/1000000","v":{"$error":"#DIV/0!"}},30.000000000000156,{"$error":"#VALUE!"},{"$error":"#VALUE!"},null,null,null,null,null,null,null,null,null,null,null,null,null,null,null,null,{"$f":"'Input Screen'!$C$8*5280*$AU$4*'Input Screen'!$C$9*2*(T305-$T$6)/12*0.0575","v":{"$error":"#DIV/0!"}},{"$error":"#DIV/0!"},{"$f":"AS305/($AU$4*'Input Screen'!$C$8)","v":{"$error":"#DIV/0!"}},{"$error":"#DIV/0!"},{"$error":"#DIV/0!"},{"$f":"AS305*'Input Screen'!$C$21/1000000","v":{"$error":"#DIV/0!"}}]
[null,null,null,null,null,null,null,null,null,null,null,null,null,null,null,null,null,null,null,{"$error":"#DIV/0!"},{"$f":"'Input Screen'!$C$8*5280*'Input Screen'!$C$9*2*(T306-$T$6)/12*0.0575","v":{"$error":"#DIV/0!"}},{"$f":"U306/'Input Screen'!$C$8","v":{"$error":"#DIV/0!"}},{"$error":"#DIV/0!"},{"$error":"#DIV/0!"},{"$f":"U306*'Input Screen'!$C$21/1000000","v":{"$error":"#DIV/0!"}},30.100000000000158,{"$error":"#VALUE!"},{"$error":"#VALUE!"},null,null,null,null,null,null,null,null,null,null,null,null,null,null,null,null,{"$f":"'Input Screen'!$C$8*5280*$AU$4*'Input Screen'!$C$9*2*(T306-$T$6)/12*0.0575","v":{"$error":"#DIV/0!"}},{"$error":"#DIV/0!"},{"$f":"AS306/($AU$4*'Input Screen'!$C$8)","v":{"$error":"#DIV/0!"}},{"$error":"#DIV/0!"},{"$error":"#DIV/0!"},{"$f":"AS306*'Input Screen'!$C$21/1000000","v":{"$error":"#DIV/0!"}}]
[null,null,null,null,null,null,null,null,null,null,null,null,null,null,null,null,null,null,null,{"$error":"#DIV/0!"},{"$f":"'Input Screen'!$C$8*5280*'Input Screen'!$C$9*2*(T307-$T$6)/12*0.0575","v":{"$error":"#DIV/0!"}},{"$f":"U307/'Input Screen'!$C$8","v":{"$error":"#DIV/0!"}},{"$error":"#DIV/0!"},{"$error":"#DIV/0!"},{"$f":"U307*'Input Screen'!$C$21/1000000","v":{"$error":"#DIV/0!"}},30.200000000000159,{"$error":"#VALUE!"},{"$error":"#VALUE!"},null,null,null,null,null,null,null,null,null,null,null,null,null,null,null,null,{"$f":"'Input Screen'!$C$8*5280*$AU$4*'Input Screen'!$C$9*2*(T307-$T$6)/12*0.0575","v":{"$error":"#DIV/0!"}},{"$error":"#DIV/0!"},{"$f":"AS307/($AU$4*'Input Screen'!$C$8)","v":{"$error":"#DIV/0!"}},{"$error":"#DIV/0!"},{"$error":"#DIV/0!"},{"$f":"AS307*'Input Screen'!$C$21/1000000","v":{"$error":"#DIV/0!"}}]
[null,null,null,null,null,null,null,null,null,null,null,null,null,null,null,null,null,null,null,{"$error":"#DIV/0!"},{"$f":"'Input Screen'!$C$8*5280*'Input Screen'!$C$9*2*(T308-$T$6)/12*0.0575","v":{"$error":"#DIV/0!"}},{"$f":"U308/'Input Screen'!$C$8","v":{"$error":"#DIV/0!"}},{"$error":"#DIV/0!"},{"$error":"#DIV/0!"},{"$f":"U308*'Input Screen'!$C$21/1000000","v":{"$error":"#DIV/0!"}},30.300000000000161,{"$error":"#VALUE!"},{"$error":"#VALUE!"},null,null,null,null,null,null,null,null,null,null,null,null,null,null,null,null,{"$f":"'Input Screen'!$C$8*5280*$AU$4*'Input Screen'!$C$9*2*(T308-$T$6)/12*0.0575","v":{"$error":"#DIV/0!"}},{"$error":"#DIV/0!"},{"$f":"AS308/($AU$4*'Input Screen'!$C$8)","v":{"$error":"#DIV/0!"}},{"$error":"#DIV/0!"},{"$error":"#DIV/0!"},{"$f":"AS308*'Input Screen'!$C$21/1000000","v":{"$error":"#DIV/0!"}}]
[null,null,null,null,null,null,null,null,null,null,null,null,null,null,null,null,null,null,null,{"$error":"#DIV/0!"},{"$f":"'Input Screen'!$C$8*5280*'Input Screen'!$C$9*2*(T309-$T$6)/12*0.0575","v":{"$error":"#DIV/0!"}},{"$f":"U309/'Input Screen'!$C$8","v":{"$error":"#DIV/0!"}},{"$error":"#DIV/0!"},{"$error":"#DIV/0!"},{"$f":"U309*'Input Screen'!$C$21/1000000","v":{"$error":"#DIV/0!"}},30.400000000000162,{"$error":"#VALUE!"},{"$error":"#VALUE!"},null,null,null,null,null,null,null,null,null,null,null,null,null,null,null,null,{"$f":"'Input Screen'!$C$8*5280*$AU$4*'Input Screen'!$C$9*2*(T309-$T$6)/12*0.0575","v":{"$error":"#DIV/0!"}},{"$error":"#DIV/0!"},{"$f":"AS309/($AU$4*'Input Screen'!$C$8)","v":{"$error":"#DIV/0!"}},{"$error":"#DIV/0!"},{"$error":"#DIV/0!"},{"$f":"AS309*'Input Screen'!$C$21/1000000","v":{"$error":"#DIV/0!"}}]
[null,null,null,null,null,null,null,null,null,null,null,null,null,null,null,null,null,null,null,{"$error":"#DIV/0!"},{"$f":"'Input Screen'!$C$8*5280*'Input Screen'!$C$9*2*(T310-$T$6)/12*0.0575","v":{"$error":"#DIV/0!"}},{"$f":"U310/'Input Screen'!$C$8","v":{"$error":"#DIV/0!"}},{"$error":"#DIV/0!"},{"$error":"#DIV/0!"},{"$f":"U310*'Input Screen'!$C$21/1000000","v":{"$error":"#DIV/0!"}},30.500000000000163,{"$error":"#VALUE!"},{"$error":"#VALUE!"},null,null,null,null,null,null,null,null,null,null,null,null,null,null,null,null,{"$f":"'Input Screen'!$C$8*5280*$AU$4*'Input Screen'!$C$9*2*(T310-$T$6)/12*0.0575","v":{"$error":"#DIV/0!"}},{"$error":"#DIV/0!"},{"$f":"AS310/($AU$4*'Input Screen'!$C$8)","v":{"$error":"#DIV/0!"}},{"$error":"#DIV/0!"},{"$error":"#DIV/0!"},{"$f":"AS310*'Input Screen'!$C$21/1000000","v":{"$error":"#DIV/0!"}}]
[null,null,null,null,null,null,null,null,null,null,null,null,null,null,null,null,null,null,null,{"$error":"#DIV/0!"},{"$f":"'Input Screen'!$C$8*5280*'Input Screen'!$C$9*2*(T311-$T$6)/12*0.0575","v":{"$error":"#DIV/0!"}},{"$f":"U311/'Input Screen'!$C$8","v":{"$error":"#DIV/0!"}},{"$error":"#DIV/0!"},{"$error":"#DIV/0!"},{"$f":"U311*'Input Screen'!$C$21/1000000","v":{"$error":"#DIV/0!"}},30.600000000000165,{"$error":"#VALUE!"},{"$error":"#VALUE!"},null,null,null,null,null,null,null,null,null,null,null,null,null,null,null,null,{"$f":"'Input Screen'!$C$8*5280*$AU$4*'Input Screen'!$C$9*2*(T311-$T$6)/12*0.0575","v":{"$error":"#DIV/0!"}},{"$error":"#DIV/0!"},{"$f":"AS311/($AU$4*'Input Screen'!$C$8)","v":{"$error":"#DIV/0!"}},{"$error":"#DIV/0!"},{"$error":"#DIV/0!"},{"$f":"AS311*'Input Screen'!$C$21/1000000","v":{"$error":"#DIV/0!"}}]
[null,null,null,null,null,null,null,null,null,null,null,null,null,null,null,null,null,null,null,{"$error":"#DIV/0!"},{"$f":"'Input Screen'!$C$8*5280*'Input Screen'!$C$9*2*(T312-$T$6)/12*0.0575","v":{"$error":"#DIV/0!"}},{"$f":"U312/'Input Screen'!$C$8","v":{"$error":"#DIV/0!"}},{"$error":"#DIV/0!"},{"$error":"#DIV/0!"},{"$f":"U312*'Input Screen'!$C$21/1000000","v":{"$error":"#DIV/0!"}},30.700000000000166,{"$error":"#VALUE!"},{"$error":"#VALUE!"},null,null,null,null,null,null,null,null,null,null,null,null,null,null,null,null,{"$f":"'Input Screen'!$C$8*5280*$AU$4*'Input Screen'!$C$9*2*(T312-$T$6)/12*0.0575","v":{"$error":"#DIV/0!"}},{"$error":"#DIV/0!"},{"$f":"AS312/($AU$4*'Input Screen'!$C$8)","v":{"$error":"#DIV/0!"}},{"$error":"#DIV/0!"},{"$error":"#DIV/0!"},{"$f":"AS312*'Input Screen'!$C$21/1000000","v":{"$error":"#DIV/0!"}}]
[null,null,null,null,null,null,null,null,null,null,null,null,null,null,null,null,null,null,null,{"$error":"#DIV/0!"},{"$f":"'Input Screen'!$C$8*5280*'Input Screen'!$C$9*2*(T313-$T$6)/12*0.0575","v":{"$error":"#DIV/0!"}},{"$f":"U313/'Input Screen'!$C$8","v":{"$error":"#DIV/0!"}},{"$error":"#DIV/0!"},{"$error":"#DIV/0!"},{"$f":"U313*'Input Screen'!$C$21/1000000","v":{"$error":"#DIV/0!"}},30.800000000000168,{"$error":"#VALUE!"},{"$error":"#VALUE!"},null,null,null,null,null,null,null,null,null,null,null,null,null,null,null,null,{"$f":"'Input Screen'!$C$8*5280*$AU$4*'Input Screen'!$C$9*2*(T313-$T$6)/12*0.0575","v":{"$error":"#DIV/0!"}},{"$error":"#DIV/0!"},{"$f":"AS313/($AU$4*'Input Screen'!$C$8)","v":{"$error":"#DIV/0!"}},{"$error":"#DIV/0!"},{"$error":"#DIV/0!"},{"$f":"AS313*'Input Screen'!$C$21/1000000","v":{"$error":"#DIV/0!"}}]
[null,null,null,null,null,null,null,null,null,null,null,null,null,null,null,null,null,null,null,{"$error":"#DIV/0!"},{"$f":"'Input Screen'!$C$8*5280*'Input Screen'!$C$9*2*(T314-$T$6)/12*0.0575","v":{"$error":"#DIV/0!"}},{"$f":"U314/'Input Screen'!$C$8","v":{"$error":"#DIV/0!"}},{"$error":"#DIV/0!"},{"$error":"#DIV/0!"},{"$f":"U314*'Input Screen'!$C$21/1000000","v":{"$error":"#DIV/0!"}},30.900000000000169,{"$error":"#VALUE!"},{"$error":"#VALUE!"},null,null,null,null,null,null,null,null,null,null,null,null,null,null,null,null,{"$f":"'Input Screen'!$C$8*5280*$AU$4*'Input Screen'!$C$9*2*(T314-$T$6)/12*0.0575","v":{"$error":"#DIV/0!"}},{"$error":"#DIV/0!"},{"$f":"AS314/($AU$4*'Input Screen'!$C$8)","v":{"$error":"#DIV/0!"}},{"$error":"#DIV/0!"},{"$error":"#DIV/0!"},{"$f":"AS314*'Input Screen'!$C$21/1000000","v":{"$error":"#DIV/0!"}}]
[null,null,null,null,null,null,null,null,null,null,null,null,null,null,null,null,null,null,null,{"$error":"#DIV/0!"},{"$f":"'Input Screen'!$C$8*5280*'Input Screen'!$C$9*2*(T315-$T$6)/12*0.0575","v":{"$error":"#DIV/0!"}},{"$f":"U315/'Input Screen'!$C$8","v":{"$error":"#DIV/0!"}},{"$error":"#DIV/0!"},{"$error":"#DIV/0!"},{"$f":"U315*'Input Screen'!$C$21/1000000","v":{"$error":"#DIV/0!"}},31.000000000000171,{"$error":"#VALUE!"},{"$error":"#VALUE!"},null,null,null,null,null,null,null,null,null,null,null,null,null,null,null,null,{"$f":"'Input Screen'!$C$8*5280*$AU$4*'Input Screen'!$C$9*2*(T315-$T$6)/12*0.0575","v":{"$error":"#DIV/0!"}},{"$error":"#DIV/0!"},{"$f":"AS315/($AU$4*'Input Screen'!$C$8)","v":{"$error":"#DIV/0!"}},{"$error":"#DIV/0!"},{"$error":"#DIV/0!"},{"$f":"AS315*'Input Screen'!$C$21/1000000","v":{"$error":"#DIV/0!"}}]
[null,null,null,null,null,null,null,null,null,null,null,null,null,null,null,null,null,null,null,{"$error":"#DIV/0!"},{"$f":"'Input Screen'!$C$8*5280*'Input Screen'!$C$9*2*(T316-$T$6)/12*0.0575","v":{"$error":"#DIV/0!"}},{"$f":"U316/'Input Screen'!$C$8","v":{"$error":"#DIV/0!"}},{"$error":"#DIV/0!"},{"$error":"#DIV/0!"},{"$f":"U316*'Input Screen'!$C$21/1000000","v":{"$error":"#DIV/0!"}},31.100000000000172,{"$error":"#VALUE!"},{"$error":"#VALUE!"},null,null,null,null,null,null,null,null,null,null,null,null,null,null,null,null,{"$f":"'Input Screen'!$C$8*5280*$AU$4*'Input Screen'!$C$9*2*(T316-$T$6)/12*0.0575","v":{"$error":"#DIV/0!"}},{"$error":"#DIV/0!"},{"$f":"AS316/($AU$4*'Input Screen'!$C$8)","v":{"$error":"#DIV/0!"}},{"$error":"#DIV/0!"},{"$error":"#DIV/0!"},{"$f":"AS316*'Input Screen'!$C$21/1000000","v":{"$error":"#DIV/0!"}}]
[null,null,null,null,null,null,null,null,null,null,null,null,null,null,null,null,null,null,null,{"$error":"#DIV/0!"},{"$f":"'Input Screen'!$C$8*5280*'Input Screen'!$C$9*2*(T317-$T$6)/12*0.0575","v":{"$error":"#DIV/0!"}},{"$f":"U317/'Input Screen'!$C$8","v":{"$error":"#DIV/0!"}},{"$error":"#DIV/0!"},{"$error":"#DIV/0!"},{"$f":"U317*'Input Screen'!$C$21/1000000","v":{"$error":"#DIV/0!"}},31.200000000000173,{"$error":"#VALUE!"},{"$error":"#VALUE!"},null,null,null,null,null,null,null,null,null,null,null,null,null,null,null,null,{"$f":"'Input Screen'!$C$8*5280*$AU$4*'Input Screen'!$C$9*2*(T317-$T$6)/12*0.0575","v":{"$error":"#DIV/0!"}},{"$error":"#DIV/0!"},{"$f":"AS317/($AU$4*'Input Screen'!$C$8)","v":{"$error":"#DIV/0!"}},{"$error":"#DIV/0!"},{"$error":"#DIV/0!"},{"$f":"AS317*'Input Screen'!$C$21/1000000","v":{"$error":"#DIV/0!"}}]
[null,null,null,null,null,null,null,null,null,null,null,null,null,null,null,null,null,null,null,{"$error":"#DIV/0!"},{"$f":"'Input Screen'!$C$8*5280*'Input Screen'!$C$9*2*(T318-$T$6)/12*0.0575","v":{"$error":"#DIV/0!"}},{"$f":"U318/'Input Screen'!$C$8","v":{"$error":"#DIV/0!"}},{"$error":"#DIV/0!"},{"$error":"#DIV/0!"},{"$f":"U318*'Input Screen'!$C$21/1000000","v":{"$error":"#DIV/0!"}},31.300000000000175,{"$error":"#VALUE!"},{"$error":"#VALUE!"},null,null,null,null,null,null,null,null,null,null,null,null,null,null,null,null,{"$f":"'Input Screen'!$C$8*5280*$AU$4*'Input Screen'!$C$9*2*(T318-$T$6)/12*0.0575","v":{"$error":"#DIV/0!"}},{"$error":"#DIV/0!"},{"$f":"AS318/($AU$4*'Input Screen'!$C$8)","v":{"$error":"#DIV/0!"}},{"$error":"#DIV/0!"},{"$error":"#DIV/0!"},{"$f":"AS318*'Input Screen'!$C$21/1000000","v":{"$error":"#DIV/0!"}}]
[null,null,null,null,null,null,null,null,null,null,null,null,null,null,null,null,null,null,null,{"$error":"#DIV/0!"},{"$f":"'Input Screen'!$C$8*5280*'Input Screen'!$C$9*2*(T319-$T$6)/12*0.0575","v":{"$error":"#DIV/0!"}},{"$f":"U319/'Input Screen'!$C$8","v":{"$error":"#DIV/0!"}},{"$error":"#DIV/0!"},{"$error":"#DIV/0!"},{"$f":"U319*'Input Screen'!$C$21/1000000","v":{"$error":"#DIV/0!"}},31.400000000000176,{"$error":"#VALUE!"},{"$error":"#VALUE!"},null,null,null,null,null,null,null,null,null,null,null,null,null,null,null,null,{"$f":"'Input Screen'!$C$8*5280*$AU$4*'Input Screen'!$C$9*2*(T319-$T$6)/12*0.0575","v":{"$error":"#DIV/0!"}},{"$error":"#DIV/0!"},{"$f":"AS319/($AU$4*'Input Screen'!$C$8)","v":{"$error":"#DIV/0!"}},{"$error":"#DIV/0!"},{"$error":"#DIV/0!"},{"$f":"AS319*'Input Screen'!$C$21/1000000","v":{"$error":"#DIV/0!"}}]
[null,null,null,null,null,null,null,null,null,null,null,null,null,null,null,null,null,null,null,{"$error":"#DIV/0!"},{"$f":"'Input Screen'!$C$8*5280*'Input Screen'!$C$9*2*(T320-$T$6)/12*0.0575","v":{"$error":"#DIV/0!"}},{"$f":"U320/'Input Screen'!$C$8","v":{"$error":"#DIV/0!"}},{"$error":"#DIV/0!"},{"$error":"#DIV/0!"},{"$f":"U320*'Input Screen'!$C$21/1000000","v":{"$error":"#DIV/0!"}},31.500000000000178,{"$error":"#VALUE!"},{"$error":"#VALUE!"},null,null,null,null,null,null,null,null,null,null,null,null,null,null,null,null,{"$f":"'Input Screen'!$C$8*5280*$AU$4*'Input Screen'!$C$9*2*(T320-$T$6)/12*0.0575","v":{"$error":"#DIV/0!"}},{"$error":"#DIV/0!"},{"$f":"AS320/($AU$4*'Input Screen'!$C$8)","v":{"$error":"#DIV/0!"}},{"$error":"#DIV/0!"},{"$error":"#DIV/0!"},{"$f":"AS320*'Input Screen'!$C$21/1000000","v":{"$error":"#DIV/0!"}}]
[null,null,null,null,null,null,null,null,null,null,null,null,null,null,null,null,null,null,null,{"$error":"#DIV/0!"},{"$f":"'Input Screen'!$C$8*5280*'Input Screen'!$C$9*2*(T321-$T$6)/12*0.0575","v":{"$error":"#DIV/0!"}},{"$f":"U321/'Input Screen'!$C$8","v":{"$error":"#DIV/0!"}},{"$error":"#DIV/0!"},{"$error":"#DIV/0!"},{"$f":"U321*'Input Screen'!$C$21/1000000","v":{"$error":"#DIV/0!"}},31.600000000000179,{"$error":"#VALUE!"},{"$error":"#VALUE!"},null,null,null,null,null,null,null,null,null,null,null,null,null,null,null,null,{"$f":"'Input Screen'!$C$8*5280*$AU$4*'Input Screen'!$C$9*2*(T321-$T$6)/12*0.0575","v":{"$error":"#DIV/0!"}},{"$error":"#DIV/0!"},{"$f":"AS321/($AU$4*'Input Screen'!$C$8)","v":{"$error":"#DIV/0!"}},{"$error":"#DIV/0!"},{"$error":"#DIV/0!"},{"$f":"AS321*'Input Screen'!$C$21/1000000","v":{"$error":"#DIV/0!"}}]
[null,null,null,null,null,null,null,null,null,null,null,null,null,null,null,null,null,null,null,{"$error":"#DIV/0!"},{"$f":"'Input Screen'!$C$8*5280*'Input Screen'!$C$9*2*(T322-$T$6)/12*0.0575","v":{"$error":"#DIV/0!"}},{"$f":"U322/'Input Screen'!$C$8","v":{"$error":"#DIV/0!"}},{"$error":"#DIV/0!"},{"$error":"#DIV/0!"},{"$f":"U322*'Input Screen'!$C$21/1000000","v":{"$error":"#DIV/0!"}},31.70000000000018,{"$error":"#VALUE!"},{"$error":"#VALUE!"},null,null,null,null,null,null,null,null,null,null,null,null,null,null,null,null,{"$f":"'Input Screen'!$C$8*5280*$AU$4*'Input Screen'!$C$9*2*(T322-$T$6)/12*0.0575","v":{"$error":"#DIV/0!"}},{"$error":"#DIV/0!"},{"$f":"AS322/($AU$4*'Input Screen'!$C$8)","v":{"$error":"#DIV/0!"}},{"$error":"#DIV/0!"},{"$error":"#DIV/0!"},{"$f":"AS322*'Input Screen'!$C$21/1000000","v":{"$error":"#DIV/0!"}}]
[null,null,null,null,null,null,null,null,null,null,null,null,null,null,null,null,null,null,null,{"$error":"#DIV/0!"},{"$f":"'Input Screen'!$C$8*5280*'Input Screen'!$C$9*2*(T323-$T$6)/12*0.0575","v":{"$error":"#DIV/0!"}},{"$f":"U323/'Input Screen'!$C$8","v":{"$error":"#DIV/0!"}},{"$error":"#DIV/0!"},{"$error":"#DIV/0!"},{"$f":"U323*'Input Screen'!$C$21/1000000","v":{"$error":"#DIV/0!"}},31.800000000000182,{"$error":"#VALUE!"},{"$error":"#VALUE!"},null,null,null,null,null,null,null,null,null,null,null,null,null,null,null,null,{"$f":"'Input Screen'!$C$8*5280*$AU$4*'Input Screen'!$C$9*2*(T323-$T$6)/12*0.0575","v":{"$error":"#DIV/0!"}},{"$error":"#DIV/0!"},{"$f":"AS323/($AU$4*'Input Screen'!$C$8)","v":{"$error":"#DIV/0!"}},{"$error":"#DIV/0!"},{"$error":"#DIV/0!"},{"$f":"AS323*'Input Screen'!$C$21/1000000","v":{"$error":"#DIV/0!"}}]
[null,null,null,null,null,null,null,null,null,null,null,null,null,null,null,null,null,null,null,{"$error":"#DIV/0!"},{"$f":"'Input Screen'!$C$8*5280*'Input Screen'!$C$9*2*(T324-$T$6)/12*0.0575","v":{"$error":"#DIV/0!"}},{"$f":"U324/'Input Screen'!$C$8","v":{"$error":"#DIV/0!"}},{"$error":"#DIV/0!"},{"$error":"#DIV/0!"},{"$f":"U324*'Input Screen'!$C$21/1000000","v":{"$error":"#DIV/0!"}},31.900000000000183,{"$error":"#VALUE!"},{"$error":"#VALUE!"},null,null,null,null,null,null,null,null,null,null,null,null,null,null,null,null,{"$f":"'Input Screen'!$C$8*5280*$AU$4*'Input Screen'!$C$9*2*(T324-$T$6)/12*0.0575","v":{"$error":"#DIV/0!"}},{"$error":"#DIV/0!"},{"$f":"AS324/($AU$4*'Input Screen'!$C$8)","v":{"$error":"#DIV/0!"}},{"$error":"#DIV/0!"},{"$error":"#DIV/0!"},{"$f":"AS324*'Input Screen'!$C$21/1000000","v":{"$error":"#DIV/0!"}}]
[null,null,null,null,null,null,null,null,null,null,null,null,null,null,null,null,null,null,null,{"$error":"#DIV/0!"},{"$f":"'Input Screen'!$C$8*5280*'Input Screen'!$C$9*2*(T325-$T$6)/12*0.0575","v":{"$error":"#DIV/0!"}},{"$f":"U325/'Input Screen'!$C$8","v":{"$error":"#DIV/0!"}},{"$error":"#DIV/0!"},{"$error":"#DIV/0!"},{"$f":"U325*'Input Screen'!$C$21/1000000","v":{"$error":"#DIV/0!"}},32.000000000000185,{"$error":"#VALUE!"},{"$error":"#VALUE!"},null,null,null,null,null,null,null,null,null,null,null,null,null,null,null,null,{"$f":"'Input Screen'!$C$8*5280*$AU$4*'Input Screen'!$C$9*2*(T325-$T$6)/12*0.0575","v":{"$error":"#DIV/0!"}},{"$error":"#DIV/0!"},{"$f":"AS325/($AU$4*'Input Screen'!$C$8)","v":{"$error":"#DIV/0!"}},{"$error":"#DIV/0!"},{"$error":"#DIV/0!"},{"$f":"AS325*'Input Screen'!$C$21/1000000","v":{"$error":"#DIV/0!"}}]
[null,null,null,null,null,null,null,null,null,null,null,null,null,null,null,null,null,null,null,{"$error":"#DIV/0!"},{"$f":"'Input Screen'!$C$8*5280*'Input Screen'!$C$9*2*(T326-$T$6)/12*0.0575","v":{"$error":"#DIV/0!"}},{"$f":"U326/'Input Screen'!$C$8","v":{"$error":"#DIV/0!"}},{"$error":"#DIV/0!"},{"$error":"#DIV/0!"},{"$f":"U326*'Input Screen'!$C$21/1000000","v":{"$error":"#DIV/0!"}},32.100000000000186,{"$error":"#VALUE!"},{"$error":"#VALUE!"},null,null,null,null,null,null,null,null,null,null,null,null,null,null,null,null,{"$f":"'Input Screen'!$C$8*5280*$AU$4*'Input Screen'!$C$9*2*(T326-$T$6)/12*0.0575","v":{"$error":"#DIV/0!"}},{"$error":"#DIV/0!"},{"$f":"AS326/($AU$4*'Input Screen'!$C$8)","v":{"$error":"#DIV/0!"}},{"$error":"#DIV/0!"},{"$error":"#DIV/0!"},{"$f":"AS326*'Input Screen'!$C$21/1000000","v":{"$error":"#DIV/0!"}}]
[null,null,null,null,null,null,null,null,null,null,null,null,null,null,null,null,null,null,null,{"$error":"#DIV/0!"},{"$f":"'Input Screen'!$C$8*5280*'Input Screen'!$C$9*2*(T327-$T$6)/12*0.0575","v":{"$error":"#DIV/0!"}},{"$f":"U327/'Input Screen'!$C$8","v":{"$error":"#DIV/0!"}},{"$f":"1-(_xlfn.NORM.S.DIST((T327-$BA$6)/((MAX($T$6:$T$306)-$BA$6)/6),TRUE))","v":{"$error":"#DIV/0!"}},{"$f":"U327*$R$6/1000000","v":{"$error":"#DIV/0!"}},{"$f":"U327*'Input Screen'!$C$21/1000000","v":{"$error":"#DIV/0!"}},32.200000000000188,{"$f":"(_xlfn.WEIBULL.DIST(Z327,$M$6,$M$7,TRUE))","v":{"$error":"#VALUE!"}},{"$f":"1-AA327","v":{"$error":"#VALUE!"}},null,null,null,null,null,null,null,null,null,null,null,null,null,null,null,null,{"$f":"'Input Screen'!$C$8*5280*$AU$4*'Input Screen'!$C$9*2*(T327-$T$6)/12*0.0575","v":{"$error":"#DIV/0!"}},{"$error":"#DIV/0!"},{"$f":"AS327/($AU$4*'Input Screen'!$C$8)","v":{"$error":"#DIV/0!"}},{"$f":"1-(_xlfn.NORM.S.DIST((AT327-$BA$6)/((MAX($T$6:$T$306)-$BA$6)/6),TRUE))","v":{"$error":"#DIV/0!"}},{"$f":"AS327*$R$6/1000000","v":{"$error":"#DIV/0!"}},{"$f":"AS327*'Input Screen'!$C$21/1000000","v":{"$error":"#DIV/0!"}}]
[null,null,null,null,null,null,null,null,null,null,null,null,null,null,null,null,null,null,null,{"$f":"IF(T327>=5,5,T327+0.01)","v":{"$error":"#DIV/0!"}},{"$f":"'Input Screen'!$C$8*5280*'Input Screen'!$C$9*2*(T328-$T$6)/12*0.0575","v":{"$error":"#DIV/0!"}},{"$f":"U328/'Input Screen'!$C$8","v":{"$error":"#DIV/0!"}},{"$error":"#DIV/0!"},{"$error":"#DIV/0!"},{"$f":"U328*'Input Screen'!$C$21/1000000","v":{"$error":"#DIV/0!"}},{"$f":"Z327+0.1","v":32.300000000000189},{"$error":"#VALUE!"},{"$error":"#VALUE!"},null,null,null,null,null,null,null,null,null,null,null,null,null,null,null,null,{"$f":"'Input Screen'!$C$8*5280*$AU$4*'Input Screen'!$C$9*2*(T328-$T$6)/12*0.0575","v":{"$error":"#DIV/0!"}},{"$f":"IF(AT327>=5,5,AT327+0.01)","v":{"$error":"#DIV/0!"}},{"$f":"AS328/($AU$4*'Input Screen'!$C$8)","v":{"$error":"#DIV/0!"}},{"$error":"#DIV/0!"},{"$error":"#DIV/0!"},{"$f":"AS328*'Input Screen'!$C$21/1000000","v":{"$error":"#DIV/0!"}}]
[null,null,null,null,null,null,null,null,null,null,null,null,null,null,null,null,null,null,null,{"$error":"#DIV/0!"},{"$f":"'Input Screen'!$C$8*5280*'Input Screen'!$C$9*2*(T329-$T$6)/12*0.0575","v":{"$error":"#DIV/0!"}},{"$f":"U329/'Input Screen'!$C$8","v":{"$error":"#DIV/0!"}},{"$error":"#DIV/0!"},{"$error":"#DIV/0!"},{"$f":"U329*'Input Screen'!$C$21/1000000","v":{"$error":"#DIV/0!"}},32.40000000000019,{"$error":"#VALUE!"},{"$error":"#VALUE!"},null,null,null,null,null,null,null,null,null,null,null,null,null,null,null,null,{"$f":"'Input Screen'!$C$8*5280*$AU$4*'Input Screen'!$C$9*2*(T329-$T$6)/12*0.0575","v":{"$error":"#DIV/0!"}},{"$error":"#DIV/0!"},{"$f":"AS329/($AU$4*'Input Screen'!$C$8)","v":{"$error":"#DIV/0!"}},{"$error":"#DIV/0!"},{"$error":"#DIV/0!"},{"$f":"AS329*'Input Screen'!$C$21/1000000","v":{"$error":"#DIV/0!"}}]
[null,null,null,null,null,null,null,null,null,null,null,null,null,null,null,null,null,null,null,{"$error":"#DIV/0!"},{"$f":"'Input Screen'!$C$8*5280*'Input Screen'!$C$9*2*(T330-$T$6)/12*0.0575","v":{"$error":"#DIV/0!"}},{"$f":"U330/'Input Screen'!$C$8","v":{"$error":"#DIV/0!"}},{"$error":"#DIV/0!"},{"$error":"#DIV/0!"},{"$f":"U330*'Input Screen'!$C$21/1000000","v":{"$error":"#DIV/0!"}},32.500000000000192,{"$error":"#VALUE!"},{"$error":"#VALUE!"},null,null,null,null,null,null,null,null,null,null,null,null,null,null,null,null,{"$f":"'Input Screen'!$C$8*5280*$AU$4*'Input Screen'!$C$9*2*(T330-$T$6)/12*0.0575","v":{"$error":"#DIV/0!"}},{"$error":"#DIV/0!"},{"$f":"AS330/($AU$4*'Input Screen'!$C$8)","v":{"$error":"#DIV/0!"}},{"$error":"#DIV/0!"},{"$error":"#DIV/0!"},{"$f":"AS330*'Input Screen'!$C$21/1000000","v":{"$error":"#DIV/0!"}}]
[null,null,null,null,null,null,null,null,null,null,null,null,null,null,null,null,null,null,null,{"$error":"#DIV/0!"},{"$f":"'Input Screen'!$C$8*5280*'Input Screen'!$C$9*2*(T331-$T$6)/12*0.0575","v":{"$error":"#DIV/0!"}},{"$f":"U331/'Input Screen'!$C$8","v":{"$error":"#DIV/0!"}},{"$error":"#DIV/0!"},{"$error":"#DIV/0!"},{"$f":"U331*'Input Screen'!$C$21/1000000","v":{"$error":"#DIV/0!"}},32.600000000000193,{"$error":"#VALUE!"},{"$error":"#VALUE!"},null,null,null,null,null,null,null,null,null,null,null,null,null,null,null,null,{"$f":"'Input Screen'!$C$8*5280*$AU$4*'Input Screen'!$C$9*2*(T331-$T$6)/12*0.0575","v":{"$error":"#DIV/0!"}},{"$error":"#DIV/0!"},{"$f":"AS331/($AU$4*'Input Screen'!$C$8)","v":{"$error":"#DIV/0!"}},{"$error":"#DIV/0!"},{"$error":"#DIV/0!"},{"$f":"AS331*'Input Screen'!$C$21/1000000","v":{"$error":"#DIV/0!"}}]
[null,null,null,null,null,null,null,null,null,null,null,null,null,null,null,null,null,null,null,{"$error":"#DIV/0!"},{"$f":"'Input Screen'!$C$8*5280*'Input Screen'!$C$9*2*(T332-$T$6)/12*0.0575","v":{"$error":"#DIV/0!"}},{"$f":"U332/'Input Screen'!$C$8","v":{"$error":"#DIV/0!"}},{"$error":"#DIV/0!"},{"$error":"#DIV/0!"},{"$f":"U332*'Input Screen'!$C$21/1000000","v":{"$error":"#DIV/0!"}},32.700000000000195,{"$error":"#VALUE!"},{"$error":"#VALUE!"},null,null,null,null,null,null,null,null,null,null,null,null,null,null,null,null,{"$f":"'Input Screen'!$C$8*5280*$AU$4*'Input Screen'!$C$9*2*(T332-$T$6)/12*0.0575","v":{"$error":"#DIV/0!"}},{"$error":"#DIV/0!"},{"$f":"AS332/($AU$4*'Input Screen'!$C$8)","v":{"$error":"#DIV/0!"}},{"$error":"#DIV/0!"},{"$error":"#DIV/0!"},{"$f":"AS332*'Input Screen'!$C$21/1000000","v":{"$error":"#DIV/0!"}}]
[null,null,null,null,null,null,null,null,null,null,null,null,null,null,null,null,null,null,null,{"$error":"#DIV/0!"},{"$f":"'Input Screen'!$C$8*5280*'Input Screen'!$C$9*2*(T333-$T$6)/12*0.0575","v":{"$error":"#DIV/0!"}},{"$f":"U333/'Input Screen'!$C$8","v":{"$error":"#DIV/0!"}},{"$error":"#DIV/0!"},{"$error":"#DIV/0!"},{"$f":"U333*'Input Screen'!$C$21/1000000","v":{"$error":"#DIV/0!"}},32.800000000000196,{"$error":"#VALUE!"},{"$error":"#VALUE!"},null,null,null,null,null,null,null,null,null,null,null,null,null,null,null,null,{"$f":"'Input Screen'!$C$8*5280*$AU$4*'Input Screen'!$C$9*2*(T333-$T$6)/12*0.0575","v":{"$error":"#DIV/0!"}},{"$error":"#DIV/0!"},{"$f":"AS333/($AU$4*'Input Screen'!$C$8)","v":{"$error":"#DIV/0!"}},{"$error":"#DIV/0!"},{"$error":"#DIV/0!"},{"$f":"AS333*'Input Screen'!$C$21/1000000","v":{"$error":"#DIV/0!"}}]
[null,null,null,null,null,null,null,null,null,null,null,null,null,null,null,null,null,null,null,{"$error":"#DIV/0!"},{"$f":"'Input Screen'!$C$8*5280*'Input Screen'!$C$9*2*(T334-$T$6)/12*0.0575","v":{"$error":"#DIV/0!"}},{"$f":"U334/'Input Screen'!$C$8","v":{"$error":"#DIV/0!"}},{"$error":"#DIV/0!"},{"$error":"#DIV/0!"},{"$f":"U334*'Input Screen'!$C$21/1000000","v":{"$error":"#DIV/0!"}},32.900000000000198,{"$error":"#VALUE!"},{"$error":"#VALUE!"},null,null,null,null,null,null,null,null,null,null,null,null,null,null,null,null,{"$f":"'Input Screen'!$C$8*5280*$AU$4*'Input Screen'!$C$9*2*(T334-$T$6)/12*0.0575","v":{"$error":"#DIV/0!"}},{"$error":"#DIV/0!"},{"$f":"AS334/($AU$4*'Input Screen'!$C$8)","v":{"$error":"#DIV/0!"}},{"$error":"#DIV/0!"},{"$error":"#DIV/0!"},{"$f":"AS334*'Input Screen'!$C$21/1000000","v":{"$error":"#DIV/0!"}}]
[null,null,null,null,null,null,null,null,null,null,null,null,null,null,null,null,null,null,null,{"$error":"#DIV/0!"},{"$f":"'Input Screen'!$C$8*5280*'Input Screen'!$C$9*2*(T335-$T$6)/12*0.0575","v":{"$error":"#DIV/0!"}},{"$f":"U335/'Input Screen'!$C$8","v":{"$error":"#DIV/0!"}},{"$error":"#DIV/0!"},{"$error":"#DIV/0!"},{"$f":"U335*'Input Screen'!$C$21/1000000","v":{"$error":"#DIV/0!"}},33.000000000000199,{"$error":"#VALUE!"},{"$error":"#VALUE!"},null,null,null,null,null,null,null,null,null,null,null,null,null,null,null,null,{"$f":"'Input Screen'!$C$8*5280*$AU$4*'Input Screen'!$C$9*2*(T335-$T$6)/12*0.0575","v":{"$error":"#DIV/0!"}},{"$error":"#DIV/0!"},{"$f":"AS335/($AU$4*'Input Screen'!$C$8)","v":{"$error":"#DIV/0!"}},{"$error":"#DIV/0!"},{"$error":"#DIV/0!"},{"$f":"AS335*'Input Screen'!$C$21/1000000","v":{"$error":"#DIV/0!"}}]
[null,null,null,null,null,null,null,null,null,null,null,null,null,null,null,null,null,null,null,{"$error":"#DIV/0!"},{"$f":"'Input Screen'!$C$8*5280*'Input Screen'!$C$9*2*(T336-$T$6)/12*0.0575","v":{"$error":"#DIV/0!"}},{"$f":"U336/'Input Screen'!$C$8","v":{"$error":"#DIV/0!"}},{"$error":"#DIV/0!"},{"$error":"#DIV/0!"},{"$f":"U336*'Input Screen'!$C$21/1000000","v":{"$error":"#DIV/0!"}},33.1000000000002,{"$error":"#VALUE!"},{"$error":"#VALUE!"},null,null,null,null,null,null,null,null,null,null,null,null,null,null,null,null,{"$f":"'Input Screen'!$C$8*5280*$AU$4*'Input Screen'!$C$9*2*(T336-$T$6)/12*0.0575","v":{"$error":"#DIV/0!"}},{"$error":"#DIV/0!"},{"$f":"AS336/($AU$4*'Input Screen'!$C$8)","v":{"$error":"#DIV/0!"}},{"$error":"#DIV/0!"},{"$error":"#DIV/0!"},{"$f":"AS336*'Input Screen'!$C$21/1000000","v":{"$error":"#DIV/0!"}}]
[null,null,null,null,null,null,null,null,null,null,null,null,null,null,null,null,null,null,null,{"$error":"#DIV/0!"},{"$f":"'Input Screen'!$C$8*5280*'Input Screen'!$C$9*2*(T337-$T$6)/12*0.0575","v":{"$error":"#DIV/0!"}},{"$f":"U337/'Input Screen'!$C$8","v":{"$error":"#DIV/0!"}},{"$error":"#DIV/0!"},{"$error":"#DIV/0!"},{"$f":"U337*'Input Screen'!$C$21/1000000","v":{"$error":"#DIV/0!"}},33.200000000000202,{"$error":"#VALUE!"},{"$error":"#VALUE!"},null,null,null,null,null,null,null,null,null,null,null,null,null,null,null,null,{"$f":"'Input Screen'!$C$8*5280*$AU$4*'Input Screen'!$C$9*2*(T337-$T$6)/12*0.0575","v":{"$error":"#DIV/0!"}},{"$error":"#DIV/0!"},{"$f":"AS337/($AU$4*'Input Screen'!$C$8)","v":{"$error":"#DIV/0!"}},{"$error":"#DIV/0!"},{"$error":"#DIV/0!"},{"$f":"AS337*'Input Screen'!$C$21/1000000","v":{"$error":"#DIV/0!"}}]
[null,null,null,null,null,null,null,null,null,null,null,null,null,null,null,null,null,null,null,{"$error":"#DIV/0!"},{"$f":"'Input Screen'!$C$8*5280*'Input Screen'!$C$9*2*(T338-$T$6)/12*0.0575","v":{"$error":"#DIV/0!"}},{"$f":"U338/'Input Screen'!$C$8","v":{"$error":"#DIV/0!"}},{"$error":"#DIV/0!"},{"$error":"#DIV/0!"},{"$f":"U338*'Input Screen'!$C$21/1000000","v":{"$error":"#DIV/0!"}},33.300000000000203,{"$error":"#VALUE!"},{"$error":"#VALUE!"},null,null,null,null,null,null,null,null,null,null,null,null,null,null,null,null,{"$f":"'Input Screen'!$C$8*5280*$AU$4*'Input Screen'!$C$9*2*(T338-$T$6)/12*0.0575","v":{"$error":"#DIV/0!"}},{"$error":"#DIV/0!"},{"$f":"AS338/($AU$4*'Input Screen'!$C$8)","v":{"$error":"#DIV/0!"}},{"$error":"#DIV/0!"},{"$error":"#DIV/0!"},{"$f":"AS338*'Input Screen'!$C$21/1000000","v":{"$error":"#DIV/0!"}}]
[null,null,null,null,null,null,null,null,null,null,null,null,null,null,null,null,null,null,null,{"$error":"#DIV/0!"},{"$f":"'Input Screen'!$C$8*5280*'Input Screen'!$C$9*2*(T339-$T$6)/12*0.0575","v":{"$error":"#DIV/0!"}},{"$f":"U339/'Input Screen'!$C$8","v":{"$error":"#DIV/0!"}},{"$error":"#DIV/0!"},{"$error":"#DIV/0!"},{"$f":"U339*'Input Screen'!$C$21/1000000","v":{"$error":"#DIV/0!"}},33.400000000000205,{"$error":"#VALUE!"},{"$error":"#VALUE!"},null,null,null,null,null,null,null,null,null,null,null,null,null,null,null,null,{"$f":"'Input Screen'!$C$8*5280*$AU$4*'Input Screen'!$C$9*2*(T339-$T$6)/12*0.0575","v":{"$error":"#DIV/0!"}},{"$error":"#DIV/0!"},{"$f":"AS339/($AU$4*'Input Screen'!$C$8)","v":{"$error":"#DIV/0!"}},{"$error":"#DIV/0!"},{"$error":"#DIV/0!"},{"$f":"AS339*'Input Screen'!$C$21/1000000","v":{"$error":"#DIV/0!"}}]
[null,null,null,null,null,null,null,null,null,null,null,null,null,null,null,null,null,null,null,{"$error":"#DIV/0!"},{"$f":"'Input Screen'!$C$8*5280*'Input Screen'!$C$9*2*(T340-$T$6)/12*0.0575","v":{"$error":"#DIV/0!"}},{"$f":"U340/'Input Screen'!$C$8","v":{"$error":"#DIV/0!"}},{"$error":"#DIV/0!"},{"$error":"#DIV/0!"},{"$f":"U340*'Input Screen'!$C$21/1000000","v":{"$error":"#DIV/0!"}},33.500000000000206,{"$error":"#VALUE!"},{"$error":"#VALUE!"},null,null,null,null,null,null,null,null,null,null,null,null,null,null,null,null,{"$f":"'Input Screen'!$C$8*5280*$AU$4*'Input Screen'!$C$9*2*(T340-$T$6)/12*0.0575","v":{"$error":"#DIV/0!"}},{"$error":"#DIV/0!"},{"$f":"AS340/($AU$4*'Input Screen'!$C$8)","v":{"$error":"#DIV/0!"}},{"$error":"#DIV/0!"},{"$error":"#DIV/0!"},{"$f":"AS340*'Input Screen'!$C$21/1000000","v":{"$error":"#DIV/0!"}}]
[null,null,null,null,null,null,null,null,null,null,null,null,null,null,null,null,null,null,null,{"$error":"#DIV/0!"},{"$f":"'Input Screen'!$C$8*5280*'Input Screen'!$C$9*2*(T341-$T$6)/12*0.0575","v":{"$error":"#DIV/0!"}},{"$f":"U341/'Input Screen'!$C$8","v":{"$error":"#DIV/0!"}},{"$error":"#DIV/0!"},{"$error":"#DIV/0!"},{"$f":"U341*'Input Screen'!$C$21/1000000","v":{"$error":"#DIV/0!"}},33.600000000000207,{"$error":"#VALUE!"},{"$error":"#VALUE!"},null,null,null,null,null,null,null,null,null,null,null,null,null,null,null,null,{"$f":"'Input Screen'!$C$8*5280*$AU$4*'Input Screen'!$C$9*2*(T341-$T$6)/12*0.0575","v":{"$error":"#DIV/0!"}},{"$error":"#DIV/0!"},{"$f":"AS341/($AU$4*'Input Screen'!$C$8)","v":{"$error":"#DIV/0!"}},{"$error":"#DIV/0!"},{"$error":"#DIV/0!"},{"$f":"AS341*'Input Screen'!$C$21/1000000","v":{"$error":"#DIV/0!"}}]
[null,null,null,null,null,null,null,null,null,null,null,null,null,null,null,null,null,null,null,{"$error":"#DIV/0!"},{"$f":"'Input Screen'!$C$8*5280*'Input Screen'!$C$9*2*(T342-$T$6)/12*0.0575","v":{"$error":"#DIV/0!"}},{"$f":"U342/'Input Screen'!$C$8","v":{"$error":"#DIV/0!"}},{"$error":"#DIV/0!"},{"$error":"#DIV/0!"},{"$f":"U342*'Input Screen'!$C$21/1000000","v":{"$error":"#DIV/0!"}},33.700000000000209,{"$error":"#VALUE!"},{"$error":"#VALUE!"},null,null,null,null,null,null,null,null,null,null,null,null,null,null,null,null,{"$f":"'Input Screen'!$C$8*5280*$AU$4*'Input Screen'!$C$9*2*(T342-$T$6)/12*0.0575","v":{"$error":"#DIV/0!"}},{"$error":"#DIV/0!"},{"$f":"AS342/($AU$4*'Input Screen'!$C$8)","v":{"$error":"#DIV/0!"}},{"$error":"#DIV/0!"},{"$error":"#DIV/0!"},{"$f":"AS342*'Input Screen'!$C$21/1000000","v":{"$error":"#DIV/0!"}}]
[null,null,null,null,null,null,null,null,null,null,null,null,null,null,null,null,null,null,null,{"$error":"#DIV/0!"},{"$f":"'Input Screen'!$C$8*5280*'Input Screen'!$C$9*2*(T343-$T$6)/12*0.0575","v":{"$error":"#DIV/0!"}},{"$f":"U343/'Input Screen'!$C$8","v":{"$error":"#DIV/0!"}},{"$error":"#DIV/0!"},{"$error":"#DIV/0!"},{"$f":"U343*'Input Screen'!$C$21/1000000","v":{"$error":"#DIV/0!"}},33.80000000000021,{"$error":"#VALUE!"},{"$error":"#VALUE!"},null,null,null,null,null,null,null,null,null,null,null,null,null,null,null,null,{"$f":"'Input Screen'!$C$8*5280*$AU$4*'Input Screen'!$C$9*2*(T343-$T$6)/12*0.0575","v":{"$error":"#DIV/0!"}},{"$error":"#DIV/0!"},{"$f":"AS343/($AU$4*'Input Screen'!$C$8)","v":{"$error":"#DIV/0!"}},{"$error":"#DIV/0!"},{"$error":"#DIV/0!"},{"$f":"AS343*'Input Screen'!$C$21/1000000","v":{"$error":"#DIV/0!"}}]
[null,null,null,null,null,null,null,null,null,null,null,null,null,null,null,null,null,null,null,{"$error":"#DIV/0!"},{"$f":"'Input Screen'!$C$8*5280*'Input Screen'!$C$9*2*(T344-$T$6)/12*0.0575","v":{"$error":"#DIV/0!"}},{"$f":"U344/'Input Screen'!$C$8","v":{"$error":"#DIV/0!"}},{"$error":"#DIV/0!"},{"$error":"#DIV/0!"},{"$f":"U344*'Input Screen'!$C$21/1000000","v":{"$error":"#DIV/0!"}},33.900000000000212,{"$error":"#VALUE!"},{"$error":"#VALUE!"},null,null,null,null,null,null,null,null,null,null,null,null,null,null,null,null,{"$f":"'Input Screen'!$C$8*5280*$AU$4*'Input Screen'!$C$9*2*(T344-$T$6)/12*0.0575","v":{"$error":"#DIV/0!"}},{"$error":"#DIV/0!"},{"$f":"AS344/($AU$4*'Input Screen'!$C$8)","v":{"$error":"#DIV/0!"}},{"$error":"#DIV/0!"},{"$error":"#DIV/0!"},{"$f":"AS344*'Input Screen'!$C$21/1000000","v":{"$error":"#DIV/0!"}}]
[null,null,null,null,null,null,null,null,null,null,null,null,null,null,null,null,null,null,null,{"$error":"#DIV/0!"},{"$f":"'Input Screen'!$C$8*5280*'Input Screen'!$C$9*2*(T345-$T$6)/12*0.0575","v":{"$error":"#DIV/0!"}},{"$f":"U345/'Input Screen'!$C$8","v":{"$error":"#DIV/0!"}},{"$error":"#DIV/0!"},{"$error":"#DIV/0!"},{"$f":"U345*'Input Screen'!$C$21/1000000","v":{"$error":"#DIV/0!"}},34.000000000000213,{"$error":"#VALUE!"},{"$error":"#VALUE!"},null,null,null,null,null,null,null,null,null,null,null,null,null,null,null,null,{"$f":"'Input Screen'!$C$8*5280*$AU$4*'Input Screen'!$C$9*2*(T345-$T$6)/12*0.0575","v":{"$error":"#DIV/0!"}},{"$error":"#DIV/0!"},{"$f":"AS345/($AU$4*'Input Screen'!$C$8)","v":{"$error":"#DIV/0!"}},{"$error":"#DIV/0!"},{"$error":"#DIV/0!"},{"$f":"AS345*'Input Screen'!$C$21/1000000","v":{"$error":"#DIV/0!"}}]
[null,null,null,null,null,null,null,null,null,null,null,null,null,null,null,null,null,null,null,{"$error":"#DIV/0!"},{"$f":"'Input Screen'!$C$8*5280*'Input Screen'!$C$9*2*(T346-$T$6)/12*0.0575","v":{"$error":"#DIV/0!"}},{"$f":"U346/'Input Screen'!$C$8","v":{"$error":"#DIV/0!"}},{"$error":"#DIV/0!"},{"$error":"#DIV/0!"},{"$f":"U346*'Input Screen'!$C$21/1000000","v":{"$error":"#DIV/0!"}},34.100000000000215,{"$error":"#VALUE!"},{"$error":"#VALUE!"},null,null,null,null,null,null,null,null,null,null,null,null,null,null,null,null,{"$f":"'Input Screen'!$C$8*5280*$AU$4*'Input Screen'!$C$9*2*(T346-$T$6)/12*0.0575","v":{"$error":"#DIV/0!"}},{"$error":"#DIV/0!"},{"$f":"AS346/($AU$4*'Input Screen'!$C$8)","v":{"$error":"#DIV/0!"}},{"$error":"#DIV/0!"},{"$error":"#DIV/0!"},{"$f":"AS346*'Input Screen'!$C$21/1000000","v":{"$error":"#DIV/0!"}}]
[null,null,null,null,null,null,null,null,null,null,null,null,null,null,null,null,null,null,null,{"$error":"#DIV/0!"},{"$f":"'Input Screen'!$C$8*5280*'Input Screen'!$C$9*2*(T347-$T$6)/12*0.0575","v":{"$error":"#DIV/0!"}},{"$f":"U347/'Input Screen'!$C$8","v":{"$error":"#DIV/0!"}},{"$error":"#DIV/0!"},{"$error":"#DIV/0!"},{"$f":"U347*'Input Screen'!$C$21/1000000","v":{"$error":"#DIV/0!"}},34.200000000000216,{"$error":"#VALUE!"},{"$error":"#VALUE!"},null,null,null,null,null,null,null,null,null,null,null,null,null,null,null,null,{"$f":"'Input Screen'!$C$8*5280*$AU$4*'Input Screen'!$C$9*2*(T347-$T$6)/12*0.0575","v":{"$error":"#DIV/0!"}},{"$error":"#DIV/0!"},{"$f":"AS347/($AU$4*'Input Screen'!$C$8)","v":{"$error":"#DIV/0!"}},{"$error":"#DIV/0!"},{"$error":"#DIV/0!"},{"$f":"AS347*'Input Screen'!$C$21/1000000","v":{"$error":"#DIV/0!"}}]
[null,null,null,null,null,null,null,null,null,null,null,null,null,null,null,null,null,null,null,{"$error":"#DIV/0!"},{"$f":"'Input Screen'!$C$8*5280*'Input Screen'!$C$9*2*(T348-$T$6)/12*0.0575","v":{"$error":"#DIV/0!"}},{"$f":"U348/'Input Screen'!$C$8","v":{"$error":"#DIV/0!"}},{"$error":"#DIV/0!"},{"$error":"#DIV/0!"},{"$f":"U348*'Input Screen'!$C$21/1000000","v":{"$error":"#DIV/0!"}},34.300000000000217,{"$error":"#VALUE!"},{"$error":"#VALUE!"},null,null,null,null,null,null,null,null,null,null,null,null,null,null,null,null,{"$f":"'Input Screen'!$C$8*5280*$AU$4*'Input Screen'!$C$9*2*(T348-$T$6)/12*0.0575","v":{"$error":"#DIV/0!"}},{"$error":"#DIV/0!"},{"$f":"AS348/($AU$4*'Input Screen'!$C$8)","v":{"$error":"#DIV/0!"}},{"$error":"#DIV/0!"},{"$error":"#DIV/0!"},{"$f":"AS348*'Input Screen'!$C$21/1000000","v":{"$error":"#DIV/0!"}}]
[null,null,null,null,null,null,null,null,null,null,null,null,null,null,null,null,null,null,null,{"$error":"#DIV/0!"},{"$f":"'Input Screen'!$C$8*5280*'Input Screen'!$C$9*2*(T349-$T$6)/12*0.0575","v":{"$error":"#DIV/0!"}},{"$f":"U349/'Input Screen'!$C$8","v":{"$error":"#DIV/0!"}},{"$error":"#DIV/0!"},{"$error":"#DIV/0!"},{"$f":"U349*'Input Screen'!$C$21/1000000","v":{"$error":"#DIV/0!"}},34.400000000000219,{"$error":"#VALUE!"},{"$error":"#VALUE!"},null,null,null,null,null,null,null,null,null,null,null,null,null,null,null,null,{"$f":"'Input Screen'!$C$8*5280*$AU$4*'Input Screen'!$C$9*2*(T349-$T$6)/12*0.0575","v":{"$error":"#DIV/0!"}},{"$error":"#DIV/0!"},{"$f":"AS349/($AU$4*'Input Screen'!$C$8)","v":{"$error":"#DIV/0!"}},{"$error":"#DIV/0!"},{"$error":"#DIV/0!"},{"$f":"AS349*'Input Screen'!$C$21/1000000","v":{"$error":"#DIV/0!"}}]
[null,null,null,null,null,null,null,null,null,null,null,null,null,null,null,null,null,null,null,{"$error":"#DIV/0!"},{"$f":"'Input Screen'!$C$8*5280*'Input Screen'!$C$9*2*(T350-$T$6)/12*0.0575","v":{"$error":"#DIV/0!"}},{"$f":"U350/'Input Screen'!$C$8","v":{"$error":"#DIV/0!"}},{"$error":"#DIV/0!"},{"$error":"#DIV/0!"},{"$f":"U350*'Input Screen'!$C$21/1000000","v":{"$error":"#DIV/0!"}},34.50000000000022,{"$error":"#VALUE!"},{"$error":"#VALUE!"},null,null,null,null,null,null,null,null,null,null,null,null,null,null,null,null,{"$f":"'Input Screen'!$C$8*5280*$AU$4*'Input Screen'!$C$9*2*(T350-$T$6)/12*0.0575","v":{"$error":"#DIV/0!"}},{"$error":"#DIV/0!"},{"$f":"AS350/($AU$4*'Input Screen'!$C$8)","v":{"$error":"#DIV/0!"}},{"$error":"#DIV/0!"},{"$error":"#DIV/0!"},{"$f":"AS350*'Input Screen'!$C$21/1000000","v":{"$error":"#DIV/0!"}}]
[null,null,null,null,null,null,null,null,null,null,null,null,null,null,null,null,null,null,null,{"$error":"#DIV/0!"},{"$f":"'Input Screen'!$C$8*5280*'Input Screen'!$C$9*2*(T351-$T$6)/12*0.0575","v":{"$error":"#DIV/0!"}},{"$f":"U351/'Input Screen'!$C$8","v":{"$error":"#DIV/0!"}},{"$error":"#DIV/0!"},{"$error":"#DIV/0!"},{"$f":"U351*'Input Screen'!$C$21/1000000","v":{"$error":"#DIV/0!"}},34.600000000000222,{"$error":"#VALUE!"},{"$error":"#VALUE!"},null,null,null,null,null,null,null,null,null,null,null,null,null,null,null,null,{"$f":"'Input Screen'!$C$8*5280*$AU$4*'Input Screen'!$C$9*2*(T351-$T$6)/12*0.0575","v":{"$error":"#DIV/0!"}},{"$error":"#DIV/0!"},{"$f":"AS351/($AU$4*'Input Screen'!$C$8)","v":{"$error":"#DIV/0!"}},{"$error":"#DIV/0!"},{"$error":"#DIV/0!"},{"$f":"AS351*'Input Screen'!$C$21/1000000","v":{"$error":"#DIV/0!"}}]
[null,null,null,null,null,null,null,null,null,null,null,null,null,null,null,null,null,null,null,{"$error":"#DIV/0!"},{"$f":"'Input Screen'!$C$8*5280*'Input Screen'!$C$9*2*(T352-$T$6)/12*0.0575","v":{"$error":"#DIV/0!"}},{"$f":"U352/'Input Screen'!$C$8","v":{"$error":"#DIV/0!"}},{"$error":"#DIV/0!"},{"$error":"#DIV/0!"},{"$f":"U352*'Input Screen'!$C$21/1000000","v":{"$error":"#DIV/0!"}},34.700000000000223,{"$error":"#VALUE!"},{"$error":"#VALUE!"},null,null,null,null,null,null,null,null,null,null,null,null,null,null,null,null,{"$f":"'Input Screen'!$C$8*5280*$AU$4*'Input Screen'!$C$9*2*(T352-$T$6)/12*0.0575","v":{"$error":"#DIV/0!"}},{"$error":"#DIV/0!"},{"$f":"AS352/($AU$4*'Input Screen'!$C$8)","v":{"$error":"#DIV/0!"}},{"$error":"#DIV/0!"},{"$error":"#DIV/0!"},{"$f":"AS352*'Input Screen'!$C$21/1000000","v":{"$error":"#DIV/0!"}}]
[null,null,null,null,null,null,null,null,null,null,null,null,null,null,null,null,null,null,null,{"$error":"#DIV/0!"},{"$f":"'Input Screen'!$C$8*5280*'Input Screen'!$C$9*2*(T353-$T$6)/12*0.0575","v":{"$error":"#DIV/0!"}},{"$f":"U353/'Input Screen'!$C$8","v":{"$error":"#DIV/0!"}},{"$error":"#DIV/0!"},{"$error":"#DIV/0!"},{"$f":"U353*'Input Screen'!$C$21/1000000","v":{"$error":"#DIV/0!"}},34.800000000000225,{"$error":"#VALUE!"},{"$error":"#VALUE!"},null,null,null,null,null,null,null,null,null,null,null,null,null,null,null,null,{"$f":"'Input Screen'!$C$8*5280*$AU$4*'Input Screen'!$C$9*2*(T353-$T$6)/12*0.0575","v":{"$error":"#DIV/0!"}},{"$error":"#DIV/0!"},{"$f":"AS353/($AU$4*'Input Screen'!$C$8)","v":{"$error":"#DIV/0!"}},{"$error":"#DIV/0!"},{"$error":"#DIV/0!"},{"$f":"AS353*'Input Screen'!$C$21/1000000","v":{"$error":"#DIV/0!"}}]
[null,null,null,null,null,null,null,null,null,null,null,null,null,null,null,null,null,null,null,{"$error":"#DIV/0!"},{"$f":"'Input Screen'!$C$8*5280*'Input Screen'!$C$9*2*(T354-$T$6)/12*0.0575","v":{"$error":"#DIV/0!"}},{"$f":"U354/'Input Screen'!$C$8","v":{"$error":"#DIV/0!"}},{"$error":"#DIV/0!"},{"$error":"#DIV/0!"},{"$f":"U354*'Input Screen'!$C$21/1000000","v":{"$error":"#DIV/0!"}},34.900000000000226,{"$error":"#VALUE!"},{"$error":"#VALUE!"},null,null,null,null,null,null,null,null,null,null,null,null,null,null,null,null,{"$f":"'Input Screen'!$C$8*5280*$AU$4*'Input Screen'!$C$9*2*(T354-$T$6)/12*0.0575","v":{"$error":"#DIV/0!"}},{"$error":"#DIV/0!"},{"$f":"AS354/($AU$4*'Input Screen'!$C$8)","v":{"$error":"#DIV/0!"}},{"$error":"#DIV/0!"},{"$error":"#DIV/0!"},{"$f":"AS354*'Input Screen'!$C$21/1000000","v":{"$error":"#DIV/0!"}}]
[null,null,null,null,null,null,null,null,null,null,null,null,null,null,null,null,null,null,null,{"$error":"#DIV/0!"},{"$f":"'Input Screen'!$C$8*5280*'Input Screen'!$C$9*2*(T355-$T$6)/12*0.0575","v":{"$error":"#DIV/0!"}},{"$f":"U355/'Input Screen'!$C$8","v":{"$error":"#DIV/0!"}},{"$error":"#DIV/0!"},{"$error":"#DIV/0!"},{"$f":"U355*'Input Screen'!$C$21/1000000","v":{"$error":"#DIV/0!"}},35.000000000000227,{"$error":"#VALUE!"},{"$error":"#VALUE!"},null,null,null,null,null,null,null,null,null,null,null,null,null,null,null,null,{"$f":"'Input Screen'!$C$8*5280*$AU$4*'Input Screen'!$C$9*2*(T355-$T$6)/12*0.0575","v":{"$error":"#DIV/0!"}},{"$error":"#DIV/0!"},{"$f":"AS355/($AU$4*'Input Screen'!$C$8)","v":{"$error":"#DIV/0!"}},{"$error":"#DIV/0!"},{"$error":"#DIV/0!"},{"$f":"AS355*'Input Screen'!$C$21/1000000","v":{"$error":"#DIV/0!"}}]
[null,null,null,null,null,null,null,null,null,null,null,null,null,null,null,null,null,null,null,{"$error":"#DIV/0!"},{"$f":"'Input Screen'!$C$8*5280*'Input Screen'!$C$9*2*(T356-$T$6)/12*0.0575","v":{"$error":"#DIV/0!"}},{"$f":"U356/'Input Screen'!$C$8","v":{"$error":"#DIV/0!"}},{"$error":"#DIV/0!"},{"$error":"#DIV/0!"},{"$f":"U356*'Input Screen'!$C$21/1000000","v":{"$error":"#DIV/0!"}},35.100000000000229,{"$error":"#VALUE!"},{"$error":"#VALUE!"},null,null,null,null,null,null,null,null,null,null,null,null,null,null,null,null,{"$f":"'Input Screen'!$C$8*5280*$AU$4*'Input Screen'!$C$9*2*(T356-$T$6)/12*0.0575","v":{"$error":"#DIV/0!"}},{"$error":"#DIV/0!"},{"$f":"AS356/($AU$4*'Input Screen'!$C$8)","v":{"$error":"#DIV/0!"}},{"$error":"#DIV/0!"},{"$error":"#DIV/0!"},{"$f":"AS356*'Input Screen'!$C$21/1000000","v":{"$error":"#DIV/0!"}}]
[null,null,null,null,null,null,null,null,null,null,null,null,null,null,null,null,null,null,null,{"$error":"#DIV/0!"},{"$f":"'Input Screen'!$C$8*5280*'Input Screen'!$C$9*2*(T357-$T$6)/12*0.0575","v":{"$error":"#DIV/0!"}},{"$f":"U357/'Input Screen'!$C$8","v":{"$error":"#DIV/0!"}},{"$error":"#DIV/0!"},{"$error":"#DIV/0!"},{"$f":"U357*'Input Screen'!$C$21/1000000","v":{"$error":"#DIV/0!"}},35.20000000000023,{"$error":"#VALUE!"},{"$error":"#VALUE!"},null,null,null,null,null,null,null,null,null,null,null,null,null,null,null,null,{"$f":"'Input Screen'!$C$8*5280*$AU$4*'Input Screen'!$C$9*2*(T357-$T$6)/12*0.0575","v":{"$error":"#DIV/0!"}},{"$error":"#DIV/0!"},{"$f":"AS357/($AU$4*'Input Screen'!$C$8)","v":{"$error":"#DIV/0!"}},{"$error":"#DIV/0!"},{"$error":"#DIV/0!"},{"$f":"AS357*'Input Screen'!$C$21/1000000","v":{"$error":"#DIV/0!"}}]
[null,null,null,null,null,null,null,null,null,null,null,null,null,null,null,null,null,null,null,{"$error":"#DIV/0!"},{"$f":"'Input Screen'!$C$8*5280*'Input Screen'!$C$9*2*(T358-$T$6)/12*0.0575","v":{"$error":"#DIV/0!"}},{"$f":"U358/'Input Screen'!$C$8","v":{"$error":"#DIV/0!"}},{"$error":"#DIV/0!"},{"$error":"#DIV/0!"},{"$f":"U358*'Input Screen'!$C$21/1000000","v":{"$error":"#DIV/0!"}},35.300000000000232,{"$error":"#VALUE!"},{"$error":"#VALUE!"},null,null,null,null,null,null,null,null,null,null,null,null,null,null,null,null,{"$f":"'Input Screen'!$C$8*5280*$AU$4*'Input Screen'!$C$9*2*(T358-$T$6)/12*0.0575","v":{"$error":"#DIV/0!"}},{"$error":"#DIV/0!"},{"$f":"AS358/($AU$4*'Input Screen'!$C$8)","v":{"$error":"#DIV/0!"}},{"$error":"#DIV/0!"},{"$error":"#DIV/0!"},{"$f":"AS358*'Input Screen'!$C$21/1000000","v":{"$error":"#DIV/0!"}}]
[null,null,null,null,null,null,null,null,null,null,null,null,null,null,null,null,null,null,null,{"$error":"#DIV/0!"},{"$f":"'Input Screen'!$C$8*5280*'Input Screen'!$C$9*2*(T359-$T$6)/12*0.0575","v":{"$error":"#DIV/0!"}},{"$f":"U359/'Input Screen'!$C$8","v":{"$error":"#DIV/0!"}},{"$error":"#DIV/0!"},{"$error":"#DIV/0!"},{"$f":"U359*'Input Screen'!$C$21/1000000","v":{"$error":"#DIV/0!"}},35.400000000000233,{"$error":"#VALUE!"},{"$error":"#VALUE!"},null,null,null,null,null,null,null,null,null,null,null,null,null,null,null,null,{"$f":"'Input Screen'!$C$8*5280*$AU$4*'Input Screen'!$C$9*2*(T359-$T$6)/12*0.0575","v":{"$error":"#DIV/0!"}},{"$error":"#DIV/0!"},{"$f":"AS359/($AU$4*'Input Screen'!$C$8)","v":{"$error":"#DIV/0!"}},{"$error":"#DIV/0!"},{"$error":"#DIV/0!"},{"$f":"AS359*'Input Screen'!$C$21/1000000","v":{"$error":"#DIV/0!"}}]
[null,null,null,null,null,null,null,null,null,null,null,null,null,null,null,null,null,null,null,{"$error":"#DIV/0!"},{"$f":"'Input Screen'!$C$8*5280*'Input Screen'!$C$9*2*(T360-$T$6)/12*0.0575","v":{"$error":"#DIV/0!"}},{"$f":"U360/'Input Screen'!$C$8","v":{"$error":"#DIV/0!"}},{"$error":"#DIV/0!"},{"$error":"#DIV/0!"},{"$f":"U360*'Input Screen'!$C$21/1000000","v":{"$error":"#DIV/0!"}},35.500000000000234,{"$error":"#VALUE!"},{"$error":"#VALUE!"},null,null,null,null,null,null,null,null,null,null,null,null,null,null,null,null,{"$f":"'Input Screen'!$C$8*5280*$AU$4*'Input Screen'!$C$9*2*(T360-$T$6)/12*0.0575","v":{"$error":"#DIV/0!"}},{"$error":"#DIV/0!"},{"$f":"AS360/($AU$4*'Input Screen'!$C$8)","v":{"$error":"#DIV/0!"}},{"$error":"#DIV/0!"},{"$error":"#DIV/0!"},{"$f":"AS360*'Input Screen'!$C$21/1000000","v":{"$error":"#DIV/0!"}}]
[null,null,null,null,null,null,null,null,null,null,null,null,null,null,null,null,null,null,null,{"$error":"#DIV/0!"},{"$f":"'Input Screen'!$C$8*5280*'Input Screen'!$C$9*2*(T361-$T$6)/12*0.0575","v":{"$error":"#DIV/0!"}},{"$f":"U361/'Input Screen'!$C$8","v":{"$error":"#DIV/0!"}},{"$error":"#DIV/0!"},{"$error":"#DIV/0!"},{"$f":"U361*'Input Screen'!$C$21/1000000","v":{"$error":"#DIV/0!"}},35.600000000000236,{"$error":"#VALUE!"},{"$error":"#VALUE!"},null,null,null,null,null,null,null,null,null,null,null,null,null,null,null,null,{"$f":"'Input Screen'!$C$8*5280*$AU$4*'Input Screen'!$C$9*2*(T361-$T$6)/12*0.0575","v":{"$error":"#DIV/0!"}},{"$error":"#DIV/0!"},{"$f":"AS361/($AU$4*'Input Screen'!$C$8)","v":{"$error":"#DIV/0!"}},{"$error":"#DIV/0!"},{"$error":"#DIV/0!"},{"$f":"AS361*'Input Screen'!$C$21/1000000","v":{"$error":"#DIV/0!"}}]
[null,null,null,null,null,null,null,null,null,null,null,null,null,null,null,null,null,null,null,{"$error":"#DIV/0!"},{"$f":"'Input Screen'!$C$8*5280*'Input Screen'!$C$9*2*(T362-$T$6)/12*0.0575","v":{"$error":"#DIV/0!"}},{"$f":"U362/'Input Screen'!$C$8","v":{"$error":"#DIV/0!"}},{"$error":"#DIV/0!"},{"$error":"#DIV/0!"},{"$f":"U362*'Input Screen'!$C$21/1000000","v":{"$error":"#DIV/0!"}},35.700000000000237,{"$error":"#VALUE!"},{"$error":"#VALUE!"},null,null,null,null,null,null,null,null,null,null,null,null,null,null,null,null,{"$f":"'Input Screen'!$C$8*5280*$AU$4*'Input Screen'!$C$9*2*(T362-$T$6)/12*0.0575","v":{"$error":"#DIV/0!"}},{"$error":"#DIV/0!"},{"$f":"AS362/($AU$4*'Input Screen'!$C$8)","v":{"$error":"#DIV/0!"}},{"$error":"#DIV/0!"},{"$error":"#DIV/0!"},{"$f":"AS362*'Input Screen'!$C$21/1000000","v":{"$error":"#DIV/0!"}}]
[null,null,null,null,null,null,null,null,null,null,null,null,null,null,null,null,null,null,null,{"$error":"#DIV/0!"},{"$f":"'Input Screen'!$C$8*5280*'Input Screen'!$C$9*2*(T363-$T$6)/12*0.0575","v":{"$error":"#DIV/0!"}},{"$f":"U363/'Input Screen'!$C$8","v":{"$error":"#DIV/0!"}},{"$error":"#DIV/0!"},{"$error":"#DIV/0!"},{"$f":"U363*'Input Screen'!$C$21/1000000","v":{"$error":"#DIV/0!"}},35.800000000000239,{"$error":"#VALUE!"},{"$error":"#VALUE!"},null,null,null,null,null,null,null,null,null,null,null,null,null,null,null,null,{"$f":"'Input Screen'!$C$8*5280*$AU$4*'Input Screen'!$C$9*2*(T363-$T$6)/12*0.0575","v":{"$error":"#DIV/0!"}},{"$error":"#DIV/0!"},{"$f":"AS363/($AU$4*'Input Screen'!$C$8)","v":{"$error":"#DIV/0!"}},{"$error":"#DIV/0!"},{"$error":"#DIV/0!"},{"$f":"AS363*'Input Screen'!$C$21/1000000","v":{"$error":"#DIV/0!"}}]
[null,null,null,null,null,null,null,null,null,null,null,null,null,null,null,null,null,null,null,{"$error":"#DIV/0!"},{"$f":"'Input Screen'!$C$8*5280*'Input Screen'!$C$9*2*(T364-$T$6)/12*0.0575","v":{"$error":"#DIV/0!"}},{"$f":"U364/'Input Screen'!$C$8","v":{"$error":"#DIV/0!"}},{"$error":"#DIV/0!"},{"$error":"#DIV/0!"},{"$f":"U364*'Input Screen'!$C$21/1000000","v":{"$error":"#DIV/0!"}},35.90000000000024,{"$error":"#VALUE!"},{"$error":"#VALUE!"},null,null,null,null,null,null,null,null,null,null,null,null,null,null,null,null,{"$f":"'Input Screen'!$C$8*5280*$AU$4*'Input Screen'!$C$9*2*(T364-$T$6)/12*0.0575","v":{"$error":"#DIV/0!"}},{"$error":"#DIV/0!"},{"$f":"AS364/($AU$4*'Input Screen'!$C$8)","v":{"$error":"#DIV/0!"}},{"$error":"#DIV/0!"},{"$error":"#DIV/0!"},{"$f":"AS364*'Input Screen'!$C$21/1000000","v":{"$error":"#DIV/0!"}}]
[null,null,null,null,null,null,null,null,null,null,null,null,null,null,null,null,null,null,null,{"$error":"#DIV/0!"},{"$f":"'Input Screen'!$C$8*5280*'Input Screen'!$C$9*2*(T365-$T$6)/12*0.0575","v":{"$error":"#DIV/0!"}},{"$f":"U365/'Input Screen'!$C$8","v":{"$error":"#DIV/0!"}},{"$error":"#DIV/0!"},{"$error":"#DIV/0!"},{"$f":"U365*'Input Screen'!$C$21/1000000","v":{"$error":"#DIV/0!"}},36.000000000000242,{"$error":"#VALUE!"},{"$error":"#VALUE!"},null,null,null,null,null,null,null,null,null,null,null,null,null,null,null,null,{"$f":"'Input Screen'!$C$8*5280*$AU$4*'Input Screen'!$C$9*2*(T365-$T$6)/12*0.0575","v":{"$error":"#DIV/0!"}},{"$error":"#DIV/0!"},{"$f":"AS365/($AU$4*'Input Screen'!$C$8)","v":{"$error":"#DIV/0!"}},{"$error":"#DIV/0!"},{"$error":"#DIV/0!"},{"$f":"AS365*'Input Screen'!$C$21/1000000","v":{"$error":"#DIV/0!"}}]
[null,null,null,null,null,null,null,null,null,null,null,null,null,null,null,null,null,null,null,{"$error":"#DIV/0!"},{"$f":"'Input Screen'!$C$8*5280*'Input Screen'!$C$9*2*(T366-$T$6)/12*0.0575","v":{"$error":"#DIV/0!"}},{"$f":"U366/'Input Screen'!$C$8","v":{"$error":"#DIV/0!"}},{"$error":"#DIV/0!"},{"$error":"#DIV/0!"},{"$f":"U366*'Input Screen'!$C$21/1000000","v":{"$error":"#DIV/0!"}},36.100000000000243,{"$error":"#VALUE!"},{"$error":"#VALUE!"},null,null,null,null,null,null,null,null,null,null,null,null,null,null,null,null,{"$f":"'Input Screen'!$C$8*5280*$AU$4*'Input Screen'!$C$9*2*(T366-$T$6)/12*0.0575","v":{"$error":"#DIV/0!"}},{"$error":"#DIV/0!"},{"$f":"AS366/($AU$4*'Input Screen'!$C$8)","v":{"$error":"#DIV/0!"}},{"$error":"#DIV/0!"},{"$error":"#DIV/0!"},{"$f":"AS366*'Input Screen'!$C$21/1000000","v":{"$error":"#DIV/0!"}}]
[null,null,null,null,null,null,null,null,null,null,null,null,null,null,null,null,null,null,null,{"$error":"#DIV/0!"},{"$f":"'Input Screen'!$C$8*5280*'Input Screen'!$C$9*2*(T367-$T$6)/12*0.0575","v":{"$error":"#DIV/0!"}},{"$f":"U367/'Input Screen'!$C$8","v":{"$error":"#DIV/0!"}},{"$error":"#DIV/0!"},{"$error":"#DIV/0!"},{"$f":"U367*'Input Screen'!$C$21/1000000","v":{"$error":"#DIV/0!"}},36.200000000000244,{"$error":"#VALUE!"},{"$error":"#VALUE!"},null,null,null,null,null,null,null,null,null,null,null,null,null,null,null,null,{"$f":"'Input Screen'!$C$8*5280*$AU$4*'Input Screen'!$C$9*2*(T367-$T$6)/12*0.0575","v":{"$error":"#DIV/0!"}},{"$error":"#DIV/0!"},{"$f":"AS367/($AU$4*'Input Screen'!$C$8)","v":{"$error":"#DIV/0!"}},{"$error":"#DIV/0!"},{"$error":"#DIV/0!"},{"$f":"AS367*'Input Screen'!$C$21/1000000","v":{"$error":"#DIV/0!"}}]
[null,null,null,null,null,null,null,null,null,null,null,null,null,null,null,null,null,null,null,{"$error":"#DIV/0!"},{"$f":"'Input Screen'!$C$8*5280*'Input Screen'!$C$9*2*(T368-$T$6)/12*0.0575","v":{"$error":"#DIV/0!"}},{"$f":"U368/'Input Screen'!$C$8","v":{"$error":"#DIV/0!"}},{"$error":"#DIV/0!"},{"$error":"#DIV/0!"},{"$f":"U368*'Input Screen'!$C$21/1000000","v":{"$error":"#DIV/0!"}},36.300000000000246,{"$error":"#VALUE!"},{"$error":"#VALUE!"},null,null,null,null,null,null,null,null,null,null,null,null,null,null,null,null,{"$f":"'Input Screen'!$C$8*5280*$AU$4*'Input Screen'!$C$9*2*(T368-$T$6)/12*0.0575","v":{"$error":"#DIV/0!"}},{"$error":"#DIV/0!"},{"$f":"AS368/($AU$4*'Input Screen'!$C$8)","v":{"$error":"#DIV/0!"}},{"$error":"#DIV/0!"},{"$error":"#DIV/0!"},{"$f":"AS368*'Input Screen'!$C$21/1000000","v":{"$error":"#DIV/0!"}}]
[null,null,null,null,null,null,null,null,null,null,null,null,null,null,null,null,null,null,null,{"$error":"#DIV/0!"},{"$f":"'Input Screen'!$C$8*5280*'Input Screen'!$C$9*2*(T369-$T$6)/12*0.0575","v":{"$error":"#DIV/0!"}},{"$f":"U369/'Input Screen'!$C$8","v":{"$error":"#DIV/0!"}},{"$error":"#DIV/0!"},{"$error":"#DIV/0!"},{"$f":"U369*'Input Screen'!$C$21/1000000","v":{"$error":"#DIV/0!"}},36.400000000000247,{"$error":"#VALUE!"},{"$error":"#VALUE!"},null,null,null,null,null,null,null,null,null,null,null,null,null,null,null,null,{"$f":"'Input Screen'!$C$8*5280*$AU$4*'Input Screen'!$C$9*2*(T369-$T$6)/12*0.0575","v":{"$error":"#DIV/0!"}},{"$error":"#DIV/0!"},{"$f":"AS369/($AU$4*'Input Screen'!$C$8)","v":{"$error":"#DIV/0!"}},{"$error":"#DIV/0!"},{"$error":"#DIV/0!"},{"$f":"AS369*'Input Screen'!$C$21/1000000","v":{"$error":"#DIV/0!"}}]
[null,null,null,null,null,null,null,null,null,null,null,null,null,null,null,null,null,null,null,{"$error":"#DIV/0!"},{"$f":"'Input Screen'!$C$8*5280*'Input Screen'!$C$9*2*(T370-$T$6)/12*0.0575","v":{"$error":"#DIV/0!"}},{"$f":"U370/'Input Screen'!$C$8","v":{"$error":"#DIV/0!"}},{"$error":"#DIV/0!"},{"$error":"#DIV/0!"},{"$f":"U370*'Input Screen'!$C$21/1000000","v":{"$error":"#DIV/0!"}},36.500000000000249,{"$error":"#VALUE!"},{"$error":"#VALUE!"},null,null,null,null,null,null,null,null,null,null,null,null,null,null,null,null,{"$f":"'Input Screen'!$C$8*5280*$AU$4*'Input Screen'!$C$9*2*(T370-$T$6)/12*0.0575","v":{"$error":"#DIV/0!"}},{"$error":"#DIV/0!"},{"$f":"AS370/($AU$4*'Input Screen'!$C$8)","v":{"$error":"#DIV/0!"}},{"$error":"#DIV/0!"},{"$error":"#DIV/0!"},{"$f":"AS370*'Input Screen'!$C$21/1000000","v":{"$error":"#DIV/0!"}}]
[null,null,null,null,null,null,null,null,null,null,null,null,null,null,null,null,null,null,null,{"$error":"#DIV/0!"},{"$f":"'Input Screen'!$C$8*5280*'Input Screen'!$C$9*2*(T371-$T$6)/12*0.0575","v":{"$error":"#DIV/0!"}},{"$f":"U371/'Input Screen'!$C$8","v":{"$error":"#DIV/0!"}},{"$error":"#DIV/0!"},{"$error":"#DIV/0!"},{"$f":"U371*'Input Screen'!$C$21/1000000","v":{"$error":"#DIV/0!"}},36.60000000000025,{"$error":"#VALUE!"},{"$error":"#VALUE!"},null,null,null,null,null,null,null,null,null,null,null,null,null,null,null,null,{"$f":"'Input Screen'!$C$8*5280*$AU$4*'Input Screen'!$C$9*2*(T371-$T$6)/12*0.0575","v":{"$error":"#DIV/0!"}},{"$error":"#DIV/0!"},{"$f":"AS371/($AU$4*'Input Screen'!$C$8)","v":{"$error":"#DIV/0!"}},{"$error":"#DIV/0!"},{"$error":"#DIV/0!"},{"$f":"AS371*'Input Screen'!$C$21/1000000","v":{"$error":"#DIV/0!"}}]
[null,null,null,null,null,null,null,null,null,null,null,null,null,null,null,null,null,null,null,{"$error":"#DIV/0!"},{"$f":"'Input Screen'!$C$8*5280*'Input Screen'!$C$9*2*(T372-$T$6)/12*0.0575","v":{"$error":"#DIV/0!"}},{"$f":"U372/'Input Screen'!$C$8","v":{"$error":"#DIV/0!"}},{"$error":"#DIV/0!"},{"$error":"#DIV/0!"},{"$f":"U372*'Input Screen'!$C$21/1000000","v":{"$error":"#DIV/0!"}},36.700000000000252,{"$error":"#VALUE!"},{"$error":"#VALUE!"},null,null,null,null,null,null,null,null,null,null,null,null,null,null,null,null,{"$f":"'Input Screen'!$C$8*5280*$AU$4*'Input Screen'!$C$9*2*(T372-$T$6)/12*0.0575","v":{"$error":"#DIV/0!"}},{"$error":"#DIV/0!"},{"$f":"AS372/($AU$4*'Input Screen'!$C$8)","v":{"$error":"#DIV/0!"}},{"$error":"#DIV/0!"},{"$error":"#DIV/0!"},{"$f":"AS372*'Input Screen'!$C$21/1000000","v":{"$error":"#DIV/0!"}}]
[null,null,null,null,null,null,null,null,null,null,null,null,null,null,null,null,null,null,null,{"$error":"#DIV/0!"},{"$f":"'Input Screen'!$C$8*5280*'Input Screen'!$C$9*2*(T373-$T$6)/12*0.0575","v":{"$error":"#DIV/0!"}},{"$f":"U373/'Input Screen'!$C$8","v":{"$error":"#DIV/0!"}},{"$error":"#DIV/0!"},{"$error":"#DIV/0!"},{"$f":"U373*'Input Screen'!$C$21/1000000","v":{"$error":"#DIV/0!"}},36.800000000000253,{"$error":"#VALUE!"},{"$error":"#VALUE!"},null,null,null,null,null,null,null,null,null,null,null,null,null,null,null,null,{"$f":"'Input Screen'!$C$8*5280*$AU$4*'Input Screen'!$C$9*2*(T373-$T$6)/12*0.0575","v":{"$error":"#DIV/0!"}},{"$error":"#DIV/0!"},{"$f":"AS373/($AU$4*'Input Screen'!$C$8)","v":{"$error":"#DIV/0!"}},{"$error":"#DIV/0!"},{"$error":"#DIV/0!"},{"$f":"AS373*'Input Screen'!$C$21/1000000","v":{"$error":"#DIV/0!"}}]
[null,null,null,null,null,null,null,null,null,null,null,null,null,null,null,null,null,null,null,{"$error":"#DIV/0!"},{"$f":"'Input Screen'!$C$8*5280*'Input Screen'!$C$9*2*(T374-$T$6)/12*0.0575","v":{"$error":"#DIV/0!"}},{"$f":"U374/'Input Screen'!$C$8","v":{"$error":"#DIV/0!"}},{"$error":"#DIV/0!"},{"$error":"#DIV/0!"},{"$f":"U374*'Input Screen'!$C$21/1000000","v":{"$error":"#DIV/0!"}},36.900000000000254,{"$error":"#VALUE!"},{"$error":"#VALUE!"},null,null,null,null,null,null,null,null,null,null,null,null,null,null,null,null,{"$f":"'Input Screen'!$C$8*5280*$AU$4*'Input Screen'!$C$9*2*(T374-$T$6)/12*0.0575","v":{"$error":"#DIV/0!"}},{"$error":"#DIV/0!"},{"$f":"AS374/($AU$4*'Input Screen'!$C$8)","v":{"$error":"#DIV/0!"}},{"$error":"#DIV/0!"},{"$error":"#DIV/0!"},{"$f":"AS374*'Input Screen'!$C$21/1000000","v":{"$error":"#DIV/0!"}}]
[null,null,null,null,null,null,null,null,null,null,null,null,null,null,null,null,null,null,null,{"$error":"#DIV/0!"},{"$f":"'Input Screen'!$C$8*5280*'Input Screen'!$C$9*2*(T375-$T$6)/12*0.0575","v":{"$error":"#DIV/0!"}},{"$f":"U375/'Input Screen'!$C$8","v":{"$error":"#DIV/0!"}},{"$error":"#DIV/0!"},{"$error":"#DIV/0!"},{"$f":"U375*'Input Screen'!$C$21/1000000","v":{"$error":"#DIV/0!"}},37.000000000000256,{"$error":"#VALUE!"},{"$error":"#VALUE!"},null,null,null,null,null,null,null,null,null,null,null,null,null,null,null,null,{"$f":"'Input Screen'!$C$8*5280*$AU$4*'Input Screen'!$C$9*2*(T375-$T$6)/12*0.0575","v":{"$error":"#DIV/0!"}},{"$error":"#DIV/0!"},{"$f":"AS375/($AU$4*'Input Screen'!$C$8)","v":{"$error":"#DIV/0!"}},{"$error":"#DIV/0!"},{"$error":"#DIV/0!"},{"$f":"AS375*'Input Screen'!$C$21/1000000","v":{"$error":"#DIV/0!"}}]
[null,null,null,null,null,null,null,null,null,null,null,null,null,null,null,null,null,null,null,{"$error":"#DIV/0!"},{"$f":"'Input Screen'!$C$8*5280*'Input Screen'!$C$9*2*(T376-$T$6)/12*0.0575","v":{"$error":"#DIV/0!"}},{"$f":"U376/'Input Screen'!$C$8","v":{"$error":"#DIV/0!"}},{"$error":"#DIV/0!"},{"$error":"#DIV/0!"},{"$f":"U376*'Input Screen'!$C$21/1000000","v":{"$error":"#DIV/0!"}},37.100000000000257,{"$error":"#VALUE!"},{"$error":"#VALUE!"},null,null,null,null,null,null,null,null,null,null,null,null,null,null,null,null,{"$f":"'Input Screen'!$C$8*5280*$AU$4*'Input Screen'!$C$9*2*(T376-$T$6)/12*0.0575","v":{"$error":"#DIV/0!"}},{"$error":"#DIV/0!"},{"$f":"AS376/($AU$4*'Input Screen'!$C$8)","v":{"$error":"#DIV/0!"}},{"$error":"#DIV/0!"},{"$error":"#DIV/0!"},{"$f":"AS376*'Input Screen'!$C$21/1000000","v":{"$error":"#DIV/0!"}}]
[null,null,null,null,null,null,null,null,null,null,null,null,null,null,null,null,null,null,null,{"$error":"#DIV/0!"},{"$f":"'Input Screen'!$C$8*5280*'Input Screen'!$C$9*2*(T377-$T$6)/12*0.0575","v":{"$error":"#DIV/0!"}},{"$f":"U377/'Input Screen'!$C$8","v":{"$error":"#DIV/0!"}},{"$error":"#DIV/0!"},{"$error":"#DIV/0!"},{"$f":"U377*'Input Screen'!$C$21/1000000","v":{"$error":"#DIV/0!"}},37.200000000000259,{"$error":"#VALUE!"},{"$error":"#VALUE!"},null,null,null,null,null,null,null,null,null,null,null,null,null,null,null,null,{"$f":"'Input Screen'!$C$8*5280*$AU$4*'Input Screen'!$C$9*2*(T377-$T$6)/12*0.0575","v":{"$error":"#DIV/0!"}},{"$error":"#DIV/0!"},{"$f":"AS377/($AU$4*'Input Screen'!$C$8)","v":{"$error":"#DIV/0!"}},{"$error":"#DIV/0!"},{"$error":"#DIV/0!"},{"$f":"AS377*'Input Screen'!$C$21/1000000","v":{"$error":"#DIV/0!"}}]
[null,null,null,null,null,null,null,null,null,null,null,null,null,null,null,null,null,null,null,{"$error":"#DIV/0!"},{"$f":"'Input Screen'!$C$8*5280*'Input Screen'!$C$9*2*(T378-$T$6)/12*0.0575","v":{"$error":"#DIV/0!"}},{"$f":"U378/'Input Screen'!$C$8","v":{"$error":"#DIV/0!"}},{"$error":"#DIV/0!"},{"$error":"#DIV/0!"},{"$f":"U378*'Input Screen'!$C$21/1000000","v":{"$error":"#DIV/0!"}},37.30000000000026,{"$error":"#VALUE!"},{"$error":"#VALUE!"},null,null,null,null,null,null,null,null,null,null,null,null,null,null,null,null,{"$f":"'Input Screen'!$C$8*5280*$AU$4*'Input Screen'!$C$9*2*(T378-$T$6)/12*0.0575","v":{"$error":"#DIV/0!"}},{"$error":"#DIV/0!"},{"$f":"AS378/($AU$4*'Input Screen'!$C$8)","v":{"$error":"#DIV/0!"}},{"$error":"#DIV/0!"},{"$error":"#DIV/0!"},{"$f":"AS378*'Input Screen'!$C$21/1000000","v":{"$error":"#DIV/0!"}}]
[null,null,null,null,null,null,null,null,null,null,null,null,null,null,null,null,null,null,null,{"$error":"#DIV/0!"},{"$f":"'Input Screen'!$C$8*5280*'Input Screen'!$C$9*2*(T379-$T$6)/12*0.0575","v":{"$error":"#DIV/0!"}},{"$f":"U379/'Input Screen'!$C$8","v":{"$error":"#DIV/0!"}},{"$error":"#DIV/0!"},{"$error":"#DIV/0!"},{"$f":"U379*'Input Screen'!$C$21/1000000","v":{"$error":"#DIV/0!"}},37.400000000000261,{"$error":"#VALUE!"},{"$error":"#VALUE!"},null,null,null,null,null,null,null,null,null,null,null,null,null,null,null,null,{"$f":"'Input Screen'!$C$8*5280*$AU$4*'Input Screen'!$C$9*2*(T379-$T$6)/12*0.0575","v":{"$error":"#DIV/0!"}},{"$error":"#DIV/0!"},{"$f":"AS379/($AU$4*'Input Screen'!$C$8)","v":{"$error":"#DIV/0!"}},{"$error":"#DIV/0!"},{"$error":"#DIV/0!"},{"$f":"AS379*'Input Screen'!$C$21/1000000","v":{"$error":"#DIV/0!"}}]
[null,null,null,null,null,null,null,null,null,null,null,null,null,null,null,null,null,null,null,{"$error":"#DIV/0!"},{"$f":"'Input Screen'!$C$8*5280*'Input Screen'!$C$9*2*(T380-$T$6)/12*0.0575","v":{"$error":"#DIV/0!"}},{"$f":"U380/'Input Screen'!$C$8","v":{"$error":"#DIV/0!"}},{"$error":"#DIV/0!"},{"$error":"#DIV/0!"},{"$f":"U380*'Input Screen'!$C$21/1000000","v":{"$error":"#DIV/0!"}},37.500000000000263,{"$error":"#VALUE!"},{"$error":"#VALUE!"},null,null,null,null,null,null,null,null,null,null,null,null,null,null,null,null,{"$f":"'Input Screen'!$C$8*5280*$AU$4*'Input Screen'!$C$9*2*(T380-$T$6)/12*0.0575","v":{"$error":"#DIV/0!"}},{"$error":"#DIV/0!"},{"$f":"AS380/($AU$4*'Input Screen'!$C$8)","v":{"$error":"#DIV/0!"}},{"$error":"#DIV/0!"},{"$error":"#DIV/0!"},{"$f":"AS380*'Input Screen'!$C$21/1000000","v":{"$error":"#DIV/0!"}}]
[null,null,null,null,null,null,null,null,null,null,null,null,null,null,null,null,null,null,null,{"$error":"#DIV/0!"},{"$f":"'Input Screen'!$C$8*5280*'Input Screen'!$C$9*2*(T381-$T$6)/12*0.0575","v":{"$error":"#DIV/0!"}},{"$f":"U381/'Input Screen'!$C$8","v":{"$error":"#DIV/0!"}},{"$error":"#DIV/0!"},{"$error":"#DIV/0!"},{"$f":"U381*'Input Screen'!$C$21/1000000","v":{"$error":"#DIV/0!"}},37.600000000000264,{"$error":"#VALUE!"},{"$error":"#VALUE!"},null,null,null,null,null,null,null,null,null,null,null,null,null,null,null,null,{"$f":"'Input Screen'!$C$8*5280*$AU$4*'Input Screen'!$C$9*2*(T381-$T$6)/12*0.0575","v":{"$error":"#DIV/0!"}},{"$error":"#DIV/0!"},{"$f":"AS381/($AU$4*'Input Screen'!$C$8)","v":{"$error":"#DIV/0!"}},{"$error":"#DIV/0!"},{"$error":"#DIV/0!"},{"$f":"AS381*'Input Screen'!$C$21/1000000","v":{"$error":"#DIV/0!"}}]
[null,null,null,null,null,null,null,null,null,null,null,null,null,null,null,null,null,null,null,{"$error":"#DIV/0!"},{"$f":"'Input Screen'!$C$8*5280*'Input Screen'!$C$9*2*(T382-$T$6)/12*0.0575","v":{"$error":"#DIV/0!"}},{"$f":"U382/'Input Screen'!$C$8","v":{"$error":"#DIV/0!"}},{"$error":"#DIV/0!"},{"$error":"#DIV/0!"},{"$f":"U382*'Input Screen'!$C$21/1000000","v":{"$error":"#DIV/0!"}},37.700000000000266,{"$error":"#VALUE!"},{"$error":"#VALUE!"},null,null,null,null,null,null,null,null,null,null,null,null,null,null,null,null,{"$f":"'Input Screen'!$C$8*5280*$AU$4*'Input Screen'!$C$9*2*(T382-$T$6)/12*0.0575","v":{"$error":"#DIV/0!"}},{"$error":"#DIV/0!"},{"$f":"AS382/($AU$4*'Input Screen'!$C$8)","v":{"$error":"#DIV/0!"}},{"$error":"#DIV/0!"},{"$error":"#DIV/0!"},{"$f":"AS382*'Input Screen'!$C$21/1000000","v":{"$error":"#DIV/0!"}}]
[null,null,null,null,null,null,null,null,null,null,null,null,null,null,null,null,null,null,null,{"$error":"#DIV/0!"},{"$f":"'Input Screen'!$C$8*5280*'Input Screen'!$C$9*2*(T383-$T$6)/12*0.0575","v":{"$error":"#DIV/0!"}},{"$f":"U383/'Input Screen'!$C$8","v":{"$error":"#DIV/0!"}},{"$error":"#DIV/0!"},{"$error":"#DIV/0!"},{"$f":"U383*'Input Screen'!$C$21/1000000","v":{"$error":"#DIV/0!"}},37.800000000000267,{"$error":"#VALUE!"},{"$error":"#VALUE!"},null,null,null,null,null,null,null,null,null,null,null,null,null,null,null,null,{"$f":"'Input Screen'!$C$8*5280*$AU$4*'Input Screen'!$C$9*2*(T383-$T$6)/12*0.0575","v":{"$error":"#DIV/0!"}},{"$error":"#DIV/0!"},{"$f":"AS383/($AU$4*'Input Screen'!$C$8)","v":{"$error":"#DIV/0!"}},{"$error":"#DIV/0!"},{"$error":"#DIV/0!"},{"$f":"AS383*'Input Screen'!$C$21/1000000","v":{"$error":"#DIV/0!"}}]
[null,null,null,null,null,null,null,null,null,null,null,null,null,null,null,null,null,null,null,{"$error":"#DIV/0!"},{"$f":"'Input Screen'!$C$8*5280*'Input Screen'!$C$9*2*(T384-$T$6)/12*0.0575","v":{"$error":"#DIV/0!"}},{"$f":"U384/'Input Screen'!$C$8","v":{"$error":"#DIV/0!"}},{"$error":"#DIV/0!"},{"$error":"#DIV/0!"},{"$f":"U384*'Input Screen'!$C$21/1000000","v":{"$error":"#DIV/0!"}},37.900000000000269,{"$error":"#VALUE!"},{"$error":"#VALUE!"},null,null,null,null,null,null,null,null,null,null,null,null,null,null,null,null,{"$f":"'Input Screen'!$C$8*5280*$AU$4*'Input Screen'!$C$9*2*(T384-$T$6)/12*0.0575","v":{"$error":"#DIV/0!"}},{"$error":"#DIV/0!"},{"$f":"AS384/($AU$4*'Input Screen'!$C$8)","v":{"$error":"#DIV/0!"}},{"$error":"#DIV/0!"},{"$error":"#DIV/0!"},{"$f":"AS384*'Input Screen'!$C$21/1000000","v":{"$error":"#DIV/0!"}}]
[null,null,null,null,null,null,null,null,null,null,null,null,null,null,null,null,null,null,null,{"$error":"#DIV/0!"},{"$f":"'Input Screen'!$C$8*5280*'Input Screen'!$C$9*2*(T385-$T$6)/12*0.0575","v":{"$error":"#DIV/0!"}},{"$f":"U385/'Input Screen'!$C$8","v":{"$error":"#DIV/0!"}},{"$error":"#DIV/0!"},{"$error":"#DIV/0!"},{"$f":"U385*'Input Screen'!$C$21/1000000","v":{"$error":"#DIV/0!"}},38.00000000000027,{"$error":"#VALUE!"},{"$error":"#VALUE!"},null,null,null,null,null,null,null,null,null,null,null,null,null,null,null,null,{"$f":"'Input Screen'!$C$8*5280*$AU$4*'Input Screen'!$C$9*2*(T385-$T$6)/12*0.0575","v":{"$error":"#DIV/0!"}},{"$error":"#DIV/0!"},{"$f":"AS385/($AU$4*'Input Screen'!$C$8)","v":{"$error":"#DIV/0!"}},{"$error":"#DIV/0!"},{"$error":"#DIV/0!"},{"$f":"AS385*'Input Screen'!$C$21/1000000","v":{"$error":"#DIV/0!"}}]
[null,null,null,null,null,null,null,null,null,null,null,null,null,null,null,null,null,null,null,{"$error":"#DIV/0!"},{"$f":"'Input Screen'!$C$8*5280*'Input Screen'!$C$9*2*(T386-$T$6)/12*0.0575","v":{"$error":"#DIV/0!"}},{"$f":"U386/'Input Screen'!$C$8","v":{"$error":"#DIV/0!"}},{"$error":"#DIV/0!"},{"$error":"#DIV/0!"},{"$f":"U386*'Input Screen'!$C$21/1000000","v":{"$error":"#DIV/0!"}},38.100000000000271,{"$error":"#VALUE!"},{"$error":"#VALUE!"},null,null,null,null,null,null,null,null,null,null,null,null,null,null,null,null,{"$f":"'Input Screen'!$C$8*5280*$AU$4*'Input Screen'!$C$9*2*(T386-$T$6)/12*0.0575","v":{"$error":"#DIV/0!"}},{"$error":"#DIV/0!"},{"$f":"AS386/($AU$4*'Input Screen'!$C$8)","v":{"$error":"#DIV/0!"}},{"$error":"#DIV/0!"},{"$error":"#DIV/0!"},{"$f":"AS386*'Input Screen'!$C$21/1000000","v":{"$error":"#DIV/0!"}}]
[null,null,null,null,null,null,null,null,null,null,null,null,null,null,null,null,null,null,null,{"$error":"#DIV/0!"},{"$f":"'Input Screen'!$C$8*5280*'Input Screen'!$C$9*2*(T387-$T$6)/12*0.0575","v":{"$error":"#DIV/0!"}},{"$f":"U387/'Input Screen'!$C$8","v":{"$error":"#DIV/0!"}},{"$error":"#DIV/0!"},{"$error":"#DIV/0!"},{"$f":"U387*'Input Screen'!$C$21/1000000","v":{"$error":"#DIV/0!"}},38.200000000000273,{"$error":"#VALUE!"},{"$error":"#VALUE!"},null,null,null,null,null,null,null,null,null,null,null,null,null,null,null,null,{"$f":"'Input Screen'!$C$8*5280*$AU$4*'Input Screen'!$C$9*2*(T387-$T$6)/12*0.0575","v":{"$error":"#DIV/0!"}},{"$error":"#DIV/0!"},{"$f":"AS387/($AU$4*'Input Screen'!$C$8)","v":{"$error":"#DIV/0!"}},{"$error":"#DIV/0!"},{"$error":"#DIV/0!"},{"$f":"AS387*'Input Screen'!$C$21/1000000","v":{"$error":"#DIV/0!"}}]
[null,null,null,null,null,null,null,null,null,null,null,null,null,null,null,null,null,null,null,{"$error":"#DIV/0!"},{"$f":"'Input Screen'!$C$8*5280*'Input Screen'!$C$9*2*(T388-$T$6)/12*0.0575","v":{"$error":"#DIV/0!"}},{"$f":"U388/'Input Screen'!$C$8","v":{"$error":"#DIV/0!"}},{"$error":"#DIV/0!"},{"$error":"#DIV/0!"},{"$f":"U388*'Input Screen'!$C$21/1000000","v":{"$error":"#DIV/0!"}},38.300000000000274,{"$error":"#VALUE!"},{"$error":"#VALUE!"},null,null,null,null,null,null,null,null,null,null,null,null,null,null,null,null,{"$f":"'Input Screen'!$C$8*5280*$AU$4*'Input Screen'!$C$9*2*(T388-$T$6)/12*0.0575","v":{"$error":"#DIV/0!"}},{"$error":"#DIV/0!"},{"$f":"AS388/($AU$4*'Input Screen'!$C$8)","v":{"$error":"#DIV/0!"}},{"$error":"#DIV/0!"},{"$error":"#DIV/0!"},{"$f":"AS388*'Input Screen'!$C$21/1000000","v":{"$error":"#DIV/0!"}}]
[null,null,null,null,null,null,null,null,null,null,null,null,null,null,null,null,null,null,null,{"$error":"#DIV/0!"},{"$f":"'Input Screen'!$C$8*5280*'Input Screen'!$C$9*2*(T389-$T$6)/12*0.0575","v":{"$error":"#DIV/0!"}},{"$f":"U389/'Input Screen'!$C$8","v":{"$error":"#DIV/0!"}},{"$error":"#DIV/0!"},{"$error":"#DIV/0!"},{"$f":"U389*'Input Screen'!$C$21/1000000","v":{"$error":"#DIV/0!"}},38.400000000000276,{"$error":"#VALUE!"},{"$error":"#VALUE!"},null,null,null,null,null,null,null,null,null,null,null,null,null,null,null,null,{"$f":"'Input Screen'!$C$8*5280*$AU$4*'Input Screen'!$C$9*2*(T389-$T$6)/12*0.0575","v":{"$error":"#DIV/0!"}},{"$error":"#DIV/0!"},{"$f":"AS389/($AU$4*'Input Screen'!$C$8)","v":{"$error":"#DIV/0!"}},{"$error":"#DIV/0!"},{"$error":"#DIV/0!"},{"$f":"AS389*'Input Screen'!$C$21/1000000","v":{"$error":"#DIV/0!"}}]
[null,null,null,null,null,null,null,null,null,null,null,null,null,null,null,null,null,null,null,{"$error":"#DIV/0!"},{"$f":"'Input Screen'!$C$8*5280*'Input Screen'!$C$9*2*(T390-$T$6)/12*0.0575","v":{"$error":"#DIV/0!"}},{"$f":"U390/'Input Screen'!$C$8","v":{"$error":"#DIV/0!"}},{"$error":"#DIV/0!"},{"$error":"#DIV/0!"},{"$f":"U390*'Input Screen'!$C$21/1000000","v":{"$error":"#DIV/0!"}},38.500000000000277,{"$error":"#VALUE!"},{"$error":"#VALUE!"},null,null,null,null,null,null,null,null,null,null,null,null,null,null,null,null,{"$f":"'Input Screen'!$C$8*5280*$AU$4*'Input Screen'!$C$9*2*(T390-$T$6)/12*0.0575","v":{"$error":"#DIV/0!"}},{"$error":"#DIV/0!"},{"$f":"AS390/($AU$4*'Input Screen'!$C$8)","v":{"$error":"#DIV/0!"}},{"$error":"#DIV/0!"},{"$error":"#DIV/0!"},{"$f":"AS390*'Input Screen'!$C$21/1000000","v":{"$error":"#DIV/0!"}}]
[null,null,null,null,null,null,null,null,null,null,null,null,null,null,null,null,null,null,null,{"$error":"#DIV/0!"},{"$f":"'Input Screen'!$C$8*5280*'Input Screen'!$C$9*2*(T391-$T$6)/12*0.0575","v":{"$error":"#DIV/0!"}},{"$f":"U391/'Input Screen'!$C$8","v":{"$error":"#DIV/0!"}},{"$f":"1-(_xlfn.NORM.S.DIST((T391-$BA$6)/((MAX($T$6:$T$306)-$BA$6)/6),TRUE))","v":{"$error":"#DIV/0!"}},{"$f":"U391*$R$6/1000000","v":{"$error":"#DIV/0!"}},{"$f":"U391*'Input Screen'!$C$21/1000000","v":{"$error":"#DIV/0!"}},38.600000000000279,{"$f":"(_xlfn.WEIBULL.DIST(Z391,$M$6,$M$7,TRUE))","v":{"$error":"#VALUE!"}},{"$f":"1-AA391","v":{"$error":"#VALUE!"}},null,null,null,null,null,null,null,null,null,null,null,null,null,null,null,null,{"$f":"'Input Screen'!$C$8*5280*$AU$4*'Input Screen'!$C$9*2*(T391-$T$6)/12*0.0575","v":{"$error":"#DIV/0!"}},{"$error":"#DIV/0!"},{"$f":"AS391/($AU$4*'Input Screen'!$C$8)","v":{"$error":"#DIV/0!"}},{"$f":"1-(_xlfn.NORM.S.DIST((AT391-$BA$6)/((MAX($T$6:$T$306)-$BA$6)/6),TRUE))","v":{"$error":"#DIV/0!"}},{"$f":"AS391*$R$6/1000000","v":{"$error":"#DIV/0!"}},{"$f":"AS391*'Input Screen'!$C$21/1000000","v":{"$error":"#DIV/0!"}}]
[null,null,null,null,null,null,null,null,null,null,null,null,null,null,null,null,null,null,null,{"$f":"IF(T391>=5,5,T391+0.01)","v":{"$error":"#DIV/0!"}},{"$f":"'Input Screen'!$C$8*5280*'Input Screen'!$C$9*2*(T392-$T$6)/12*0.0575","v":{"$error":"#DIV/0!"}},{"$f":"U392/'Input Screen'!$C$8","v":{"$error":"#DIV/0!"}},{"$error":"#DIV/0!"},{"$error":"#DIV/0!"},{"$f":"U392*'Input Screen'!$C$21/1000000","v":{"$error":"#DIV/0!"}},{"$f":"Z391+0.1","v":38.70000000000028},{"$error":"#VALUE!"},{"$error":"#VALUE!"},null,null,null,null,null,null,null,null,null,null,null,null,null,null,null,null,{"$f":"'Input Screen'!$C$8*5280*$AU$4*'Input Screen'!$C$9*2*(T392-$T$6)/12*0.0575","v":{"$error":"#DIV/0!"}},{"$f":"IF(AT391>=5,5,AT391+0.01)","v":{"$error":"#DIV/0!"}},{"$f":"AS392/($AU$4*'Input Screen'!$C$8)","v":{"$error":"#DIV/0!"}},{"$error":"#DIV/0!"},{"$error":"#DIV/0!"},{"$f":"AS392*'Input Screen'!$C$21/1000000","v":{"$error":"#DIV/0!"}}]
[null,null,null,null,null,null,null,null,null,null,null,null,null,null,null,null,null,null,null,{"$error":"#DIV/0!"},{"$f":"'Input Screen'!$C$8*5280*'Input Screen'!$C$9*2*(T393-$T$6)/12*0.0575","v":{"$error":"#DIV/0!"}},{"$f":"U393/'Input Screen'!$C$8","v":{"$error":"#DIV/0!"}},{"$error":"#DIV/0!"},{"$error":"#DIV/0!"},{"$f":"U393*'Input Screen'!$C$21/1000000","v":{"$error":"#DIV/0!"}},38.800000000000281,{"$error":"#VALUE!"},{"$error":"#VALUE!"},null,null,null,null,null,null,null,null,null,null,null,null,null,null,null,null,{"$f":"'Input Screen'!$C$8*5280*$AU$4*'Input Screen'!$C$9*2*(T393-$T$6)/12*0.0575","v":{"$error":"#DIV/0!"}},{"$error":"#DIV/0!"},{"$f":"AS393/($AU$4*'Input Screen'!$C$8)","v":{"$error":"#DIV/0!"}},{"$error":"#DIV/0!"},{"$error":"#DIV/0!"},{"$f":"AS393*'Input Screen'!$C$21/1000000","v":{"$error":"#DIV/0!"}}]
[null,null,null,null,null,null,null,null,null,null,null,null,null,null,null,null,null,null,null,{"$error":"#DIV/0!"},{"$f":"'Input Screen'!$C$8*5280*'Input Screen'!$C$9*2*(T394-$T$6)/12*0.0575","v":{"$error":"#DIV/0!"}},{"$f":"U394/'Input Screen'!$C$8","v":{"$error":"#DIV/0!"}},{"$error":"#DIV/0!"},{"$error":"#DIV/0!"},{"$f":"U394*'Input Screen'!$C$21/1000000","v":{"$error":"#DIV/0!"}},38.900000000000283,{"$error":"#VALUE!"},{"$error":"#VALUE!"},null,null,null,null,null,null,null,null,null,null,null,null,null,null,null,null,{"$f":"'Input Screen'!$C$8*5280*$AU$4*'Input Screen'!$C$9*2*(T394-$T$6)/12*0.0575","v":{"$error":"#DIV/0!"}},{"$error":"#DIV/0!"},{"$f":"AS394/($AU$4*'Input Screen'!$C$8)","v":{"$error":"#DIV/0!"}},{"$error":"#DIV/0!"},{"$error":"#DIV/0!"},{"$f":"AS394*'Input Screen'!$C$21/1000000","v":{"$error":"#DIV/0!"}}]
[null,null,null,null,null,null,null,null,null,null,null,null,null,null,null,null,null,null,null,{"$error":"#DIV/0!"},{"$f":"'Input Screen'!$C$8*5280*'Input Screen'!$C$9*2*(T395-$T$6)/12*0.0575","v":{"$error":"#DIV/0!"}},{"$f":"U395/'Input Screen'!$C$8","v":{"$error":"#DIV/0!"}},{"$error":"#DIV/0!"},{"$error":"#DIV/0!"},{"$f":"U395*'Input Screen'!$C$21/1000000","v":{"$error":"#DIV/0!"}},39.000000000000284,{"$error":"#VALUE!"},{"$error":"#VALUE!"},null,null,null,null,null,null,null,null,null,null,null,null,null,null,null,null,{"$f":"'Input Screen'!$C$8*5280*$AU$4*'Input Screen'!$C$9*2*(T395-$T$6)/12*0.0575","v":{"$error":"#DIV/0!"}},{"$error":"#DIV/0!"},{"$f":"AS395/($AU$4*'Input Screen'!$C$8)","v":{"$error":"#DIV/0!"}},{"$error":"#DIV/0!"},{"$error":"#DIV/0!"},{"$f":"AS395*'Input Screen'!$C$21/1000000","v":{"$error":"#DIV/0!"}}]
[null,null,null,null,null,null,null,null,null,null,null,null,null,null,null,null,null,null,null,{"$error":"#DIV/0!"},{"$f":"'Input Screen'!$C$8*5280*'Input Screen'!$C$9*2*(T396-$T$6)/12*0.0575","v":{"$error":"#DIV/0!"}},{"$f":"U396/'Input Screen'!$C$8","v":{"$error":"#DIV/0!"}},{"$error":"#DIV/0!"},{"$error":"#DIV/0!"},{"$f":"U396*'Input Screen'!$C$21/1000000","v":{"$error":"#DIV/0!"}},39.100000000000286,{"$error":"#VALUE!"},{"$error":"#VALUE!"},null,null,null,null,null,null,null,null,null,null,null,null,null,null,null,null,{"$f":"'Input Screen'!$C$8*5280*$AU$4*'Input Screen'!$C$9*2*(T396-$T$6)/12*0.0575","v":{"$error":"#DIV/0!"}},{"$error":"#DIV/0!"},{"$f":"AS396/($AU$4*'Input Screen'!$C$8)","v":{"$error":"#DIV/0!"}},{"$error":"#DIV/0!"},{"$error":"#DIV/0!"},{"$f":"AS396*'Input Screen'!$C$21/1000000","v":{"$error":"#DIV/0!"}}]
[null,null,null,null,null,null,null,null,null,null,null,null,null,null,null,null,null,null,null,{"$error":"#DIV/0!"},{"$f":"'Input Screen'!$C$8*5280*'Input Screen'!$C$9*2*(T397-$T$6)/12*0.0575","v":{"$error":"#DIV/0!"}},{"$f":"U397/'Input Screen'!$C$8","v":{"$error":"#DIV/0!"}},{"$error":"#DIV/0!"},{"$error":"#DIV/0!"},{"$f":"U397*'Input Screen'!$C$21/1000000","v":{"$error":"#DIV/0!"}},39.200000000000287,{"$error":"#VALUE!"},{"$error":"#VALUE!"},null,null,null,null,null,null,null,null,null,null,null,null,null,null,null,null,{"$f":"'Input Screen'!$C$8*5280*$AU$4*'Input Screen'!$C$9*2*(T397-$T$6)/12*0.0575","v":{"$error":"#DIV/0!"}},{"$error":"#DIV/0!"},{"$f":"AS397/($AU$4*'Input Screen'!$C$8)","v":{"$error":"#DIV/0!"}},{"$error":"#DIV/0!"},{"$error":"#DIV/0!"},{"$f":"AS397*'Input Screen'!$C$21/1000000","v":{"$error":"#DIV/0!"}}]
[null,null,null,null,null,null,null,null,null,null,null,null,null,null,null,null,null,null,null,{"$error":"#DIV/0!"},{"$f":"'Input Screen'!$C$8*5280*'Input Screen'!$C$9*2*(T398-$T$6)/12*0.0575","v":{"$error":"#DIV/0!"}},{"$f":"U398/'Input Screen'!$C$8","v":{"$error":"#DIV/0!"}},{"$error":"#DIV/0!"},{"$error":"#DIV/0!"},{"$f":"U398*'Input Screen'!$C$21/1000000","v":{"$error":"#DIV/0!"}},39.300000000000288,{"$error":"#VALUE!"},{"$error":"#VALUE!"},null,null,null,null,null,null,null,null,null,null,null,null,null,null,null,null,{"$f":"'Input Screen'!$C$8*5280*$AU$4*'Input Screen'!$C$9*2*(T398-$T$6)/12*0.0575","v":{"$error":"#DIV/0!"}},{"$error":"#DIV/0!"},{"$f":"AS398/($AU$4*'Input Screen'!$C$8)","v":{"$error":"#DIV/0!"}},{"$error":"#DIV/0!"},{"$error":"#DIV/0!"},{"$f":"AS398*'Input Screen'!$C$21/1000000","v":{"$error":"#DIV/0!"}}]
[null,null,null,null,null,null,null,null,null,null,null,null,null,null,null,null,null,null,null,{"$error":"#DIV/0!"},{"$f":"'Input Screen'!$C$8*5280*'Input Screen'!$C$9*2*(T399-$T$6)/12*0.0575","v":{"$error":"#DIV/0!"}},{"$f":"U399/'Input Screen'!$C$8","v":{"$error":"#DIV/0!"}},{"$error":"#DIV/0!"},{"$error":"#DIV/0!"},{"$f":"U399*'Input Screen'!$C$21/1000000","v":{"$error":"#DIV/0!"}},39.40000000000029,{"$error":"#VALUE!"},{"$error":"#VALUE!"},null,null,null,null,null,null,null,null,null,null,null,null,null,null,null,null,{"$f":"'Input Screen'!$C$8*5280*$AU$4*'Input Screen'!$C$9*2*(T399-$T$6)/12*0.0575","v":{"$error":"#DIV/0!"}},{"$error":"#DIV/0!"},{"$f":"AS399/($AU$4*'Input Screen'!$C$8)","v":{"$error":"#DIV/0!"}},{"$error":"#DIV/0!"},{"$error":"#DIV/0!"},{"$f":"AS399*'Input Screen'!$C$21/1000000","v":{"$error":"#DIV/0!"}}]
[null,null,null,null,null,null,null,null,null,null,null,null,null,null,null,null,null,null,null,{"$error":"#DIV/0!"},{"$f":"'Input Screen'!$C$8*5280*'Input Screen'!$C$9*2*(T400-$T$6)/12*0.0575","v":{"$error":"#DIV/0!"}},{"$f":"U400/'Input Screen'!$C$8","v":{"$error":"#DIV/0!"}},{"$error":"#DIV/0!"},{"$error":"#DIV/0!"},{"$f":"U400*'Input Screen'!$C$21/1000000","v":{"$error":"#DIV/0!"}},39.500000000000291,{"$error":"#VALUE!"},{"$error":"#VALUE!"},null,null,null,null,null,null,null,null,null,null,null,null,null,null,null,null,{"$f":"'Input Screen'!$C$8*5280*$AU$4*'Input Screen'!$C$9*2*(T400-$T$6)/12*0.0575","v":{"$error":"#DIV/0!"}},{"$error":"#DIV/0!"},{"$f":"AS400/($AU$4*'Input Screen'!$C$8)","v":{"$error":"#DIV/0!"}},{"$error":"#DIV/0!"},{"$error":"#DIV/0!"},{"$f":"AS400*'Input Screen'!$C$21/1000000","v":{"$error":"#DIV/0!"}}]
[null,null,null,null,null,null,null,null,null,null,null,null,null,null,null,null,null,null,null,{"$error":"#DIV/0!"},{"$f":"'Input Screen'!$C$8*5280*'Input Screen'!$C$9*2*(T401-$T$6)/12*0.0575","v":{"$error":"#DIV/0!"}},{"$f":"U401/'Input Screen'!$C$8","v":{"$error":"#DIV/0!"}},{"$error":"#DIV/0!"},{"$error":"#DIV/0!"},{"$f":"U401*'Input Screen'!$C$21/1000000","v":{"$error":"#DIV/0!"}},39.600000000000293,{"$error":"#VALUE!"},{"$error":"#VALUE!"},null,null,null,null,null,null,null,null,null,null,null,null,null,null,null,null,{"$f":"'Input Screen'!$C$8*5280*$AU$4*'Input Screen'!$C$9*2*(T401-$T$6)/12*0.0575","v":{"$error":"#DIV/0!"}},{"$error":"#DIV/0!"},{"$f":"AS401/($AU$4*'Input Screen'!$C$8)","v":{"$error":"#DIV/0!"}},{"$error":"#DIV/0!"},{"$error":"#DIV/0!"},{"$f":"AS401*'Input Screen'!$C$21/1000000","v":{"$error":"#DIV/0!"}}]
[null,null,null,null,null,null,null,null,null,null,null,null,null,null,null,null,null,null,null,{"$error":"#DIV/0!"},{"$f":"'Input Screen'!$C$8*5280*'Input Screen'!$C$9*2*(T402-$T$6)/12*0.0575","v":{"$error":"#DIV/0!"}},{"$f":"U402/'Input Screen'!$C$8","v":{"$error":"#DIV/0!"}},{"$error":"#DIV/0!"},{"$error":"#DIV/0!"},{"$f":"U402*'Input Screen'!$C$21/1000000","v":{"$error":"#DIV/0!"}},39.700000000000294,{"$error":"#VALUE!"},{"$error":"#VALUE!"},null,null,null,null,null,null,null,null,null,null,null,null,null,null,null,null,{"$f":"'Input Screen'!$C$8*5280*$AU$4*'Input Screen'!$C$9*2*(T402-$T$6)/12*0.0575","v":{"$error":"#DIV/0!"}},{"$error":"#DIV/0!"},{"$f":"AS402/($AU$4*'Input Screen'!$C$8)","v":{"$error":"#DIV/0!"}},{"$error":"#DIV/0!"},{"$error":"#DIV/0!"},{"$f":"AS402*'Input Screen'!$C$21/1000000","v":{"$error":"#DIV/0!"}}]
[null,null,null,null,null,null,null,null,null,null,null,null,null,null,null,null,null,null,null,{"$error":"#DIV/0!"},{"$f":"'Input Screen'!$C$8*5280*'Input Screen'!$C$9*2*(T403-$T$6)/12*0.0575","v":{"$error":"#DIV/0!"}},{"$f":"U403/'Input Screen'!$C$8","v":{"$error":"#DIV/0!"}},{"$error":"#DIV/0!"},{"$error":"#DIV/0!"},{"$f":"U403*'Input Screen'!$C$21/1000000","v":{"$error":"#DIV/0!"}},39.800000000000296,{"$error":"#VALUE!"},{"$error":"#VALUE!"},null,null,null,null,null,null,null,null,null,null,null,null,null,null,null,null,{"$f":"'Input Screen'!$C$8*5280*$AU$4*'Input Screen'!$C$9*2*(T403-$T$6)/12*0.0575","v":{"$error":"#DIV/0!"}},{"$error":"#DIV/0!"},{"$f":"AS403/($AU$4*'Input Screen'!$C$8)","v":{"$error":"#DIV/0!"}},{"$error":"#DIV/0!"},{"$error":"#DIV/0!"},{"$f":"AS403*'Input Screen'!$C$21/1000000","v":{"$error":"#DIV/0!"}}]
[null,null,null,null,null,null,null,null,null,null,null,null,null,null,null,null,null,null,null,{"$error":"#DIV/0!"},{"$f":"'Input Screen'!$C$8*5280*'Input Screen'!$C$9*2*(T404-$T$6)/12*0.0575","v":{"$error":"#DIV/0!"}},{"$f":"U404/'Input Screen'!$C$8","v":{"$error":"#DIV/0!"}},{"$error":"#DIV/0!"},{"$error":"#DIV/0!"},{"$f":"U404*'Input Screen'!$C$21/1000000","v":{"$error":"#DIV/0!"}},39.900000000000297,{"$error":"#VALUE!"},{"$error":"#VALUE!"},null,null,null,null,null,null,null,null,null,null,null,null,null,null,null,null,{"$f":"'Input Screen'!$C$8*5280*$AU$4*'Input Screen'!$C$9*2*(T404-$T$6)/12*0.0575","v":{"$error":"#DIV/0!"}},{"$error":"#DIV/0!"},{"$f":"AS404/($AU$4*'Input Screen'!$C$8)","v":{"$error":"#DIV/0!"}},{"$error":"#DIV/0!"},{"$error":"#DIV/0!"},{"$f":"AS404*'Input Screen'!$C$21/1000000","v":{"$error":"#DIV/0!"}}]
[null,null,null,null,null,null,null,null,null,null,null,null,null,null,null,null,null,null,null,{"$error":"#DIV/0!"},{"$f":"'Input Screen'!$C$8*5280*'Input Screen'!$C$9*2*(T405-$T$6)/12*0.0575","v":{"$error":"#DIV/0!"}},{"$f":"U405/'Input Screen'!$C$8","v":{"$error":"#DIV/0!"}},{"$error":"#DIV/0!"},{"$error":"#DIV/0!"},{"$f":"U405*'Input Screen'!$C$21/1000000","v":{"$error":"#DIV/0!"}},40.000000000000298,{"$error":"#VALUE!"},{"$error":"#VALUE!"},null,null,null,null,null,null,null,null,null,null,null,null,null,null,null,null,{"$f":"'Input Screen'!$C$8*5280*$AU$4*'Input Screen'!$C$9*2*(T405-$T$6)/12*0.0575","v":{"$error":"#DIV/0!"}},{"$error":"#DIV/0!"},{"$f":"AS405/($AU$4*'Input Screen'!$C$8)","v":{"$error":"#DIV/0!"}},{"$error":"#DIV/0!"},{"$error":"#DIV/0!"},{"$f":"AS405*'Input Screen'!$C$21/1000000","v":{"$error":"#DIV/0!"}}]
[null,null,null,null,null,null,null,null,null,null,null,null,null,null,null,null,null,null,null,{"$error":"#DIV/0!"},{"$f":"'Input Screen'!$C$8*5280*'Input Screen'!$C$9*2*(T406-$T$6)/12*0.0575","v":{"$error":"#DIV/0!"}},{"$f":"U406/'Input Screen'!$C$8","v":{"$error":"#DIV/0!"}},{"$error":"#DIV/0!"},{"$error":"#DIV/0!"},{"$f":"U406*'Input Screen'!$C$21/1000000","v":{"$error":"#DIV/0!"}},40.1000000000003,{"$error":"#VALUE!"},{"$error":"#VALUE!"},null,null,null,null,null,null,null,null,null,null,null,null,null,null,null,null,{"$f":"'Input Screen'!$C$8*5280*$AU$4*'Input Screen'!$C$9*2*(T406-$T$6)/12*0.0575","v":{"$error":"#DIV/0!"}},{"$error":"#DIV/0!"},{"$f":"AS406/($AU$4*'Input Screen'!$C$8)","v":{"$error":"#DIV/0!"}},{"$error":"#DIV/0!"},{"$error":"#DIV/0!"},{"$f":"AS406*'Input Screen'!$C$21/1000000","v":{"$error":"#DIV/0!"}}]
[null,null,null,null,null,null,null,null,null,null,null,null,null,null,null,null,null,null,null,{"$error":"#DIV/0!"},{"$f":"'Input Screen'!$C$8*5280*'Input Screen'!$C$9*2*(T407-$T$6)/12*0.0575","v":{"$error":"#DIV/0!"}},{"$f":"U407/'Input Screen'!$C$8","v":{"$error":"#DIV/0!"}},{"$error":"#DIV/0!"},{"$error":"#DIV/0!"},{"$f":"U407*'Input Screen'!$C$21/1000000","v":{"$error":"#DIV/0!"}},40.200000000000301,{"$error":"#VALUE!"},{"$error":"#VALUE!"},null,null,null,null,null,null,null,null,null,null,null,null,null,null,null,null,{"$f":"'Input Screen'!$C$8*5280*$AU$4*'Input Screen'!$C$9*2*(T407-$T$6)/12*0.0575","v":{"$error":"#DIV/0!"}},{"$error":"#DIV/0!"},{"$f":"AS407/($AU$4*'Input Screen'!$C$8)","v":{"$error":"#DIV/0!"}},{"$error":"#DIV/0!"},{"$error":"#DIV/0!"},{"$f":"AS407*'Input Screen'!$C$21/1000000","v":{"$error":"#DIV/0!"}}]
[null,null,null,null,null,null,null,null,null,null,null,null,null,null,null,null,null,null,null,{"$error":"#DIV/0!"},{"$f":"'Input Screen'!$C$8*5280*'Input Screen'!$C$9*2*(T408-$T$6)/12*0.0575","v":{"$error":"#DIV/0!"}},{"$f":"U408/'Input Screen'!$C$8","v":{"$error":"#DIV/0!"}},{"$error":"#DIV/0!"},{"$error":"#DIV/0!"},{"$f":"U408*'Input Screen'!$C$21/1000000","v":{"$error":"#DIV/0!"}},40.300000000000303,{"$error":"#VALUE!"},{"$error":"#VALUE!"},null,null,null,null,null,null,null,null,null,null,null,null,null,null,null,null,{"$f":"'Input Screen'!$C$8*5280*$AU$4*'Input Screen'!$C$9*2*(T408-$T$6)/12*0.0575","v":{"$error":"#DIV/0!"}},{"$error":"#DIV/0!"},{"$f":"AS408/($AU$4*'Input Screen'!$C$8)","v":{"$error":"#DIV/0!"}},{"$error":"#DIV/0!"},{"$error":"#DIV/0!"},{"$f":"AS408*'Input Screen'!$C$21/1000000","v":{"$error":"#DIV/0!"}}]
[null,null,null,null,null,null,null,null,null,null,null,null,null,null,null,null,null,null,null,{"$error":"#DIV/0!"},{"$f":"'Input Screen'!$C$8*5280*'Input Screen'!$C$9*2*(T409-$T$6)/12*0.0575","v":{"$error":"#DIV/0!"}},{"$f":"U409/'Input Screen'!$C$8","v":{"$error":"#DIV/0!"}},{"$error":"#DIV/0!"},{"$error":"#DIV/0!"},{"$f":"U409*'Input Screen'!$C$21/1000000","v":{"$error":"#DIV/0!"}},40.400000000000304,{"$error":"#VALUE!"},{"$error":"#VALUE!"},null,null,null,null,null,null,null,null,null,null,null,null,null,null,null,null,{"$f":"'Input Screen'!$C$8*5280*$AU$4*'Input Screen'!$C$9*2*(T409-$T$6)/12*0.0575","v":{"$error":"#DIV/0!"}},{"$error":"#DIV/0!"},{"$f":"AS409/($AU$4*'Input Screen'!$C$8)","v":{"$error":"#DIV/0!"}},{"$error":"#DIV/0!"},{"$error":"#DIV/0!"},{"$f":"AS409*'Input Screen'!$C$21/1000000","v":{"$error":"#DIV/0!"}}]
[null,null,null,null,null,null,null,null,null,null,null,null,null,null,null,null,null,null,null,{"$error":"#DIV/0!"},{"$f":"'Input Screen'!$C$8*5280*'Input Screen'!$C$9*2*(T410-$T$6)/12*0.0575","v":{"$error":"#DIV/0!"}},{"$f":"U410/'Input Screen'!$C$8","v":{"$error":"#DIV/0!"}},{"$error":"#DIV/0!"},{"$error":"#DIV/0!"},{"$f":"U410*'Input Screen'!$C$21/1000000","v":{"$error":"#DIV/0!"}},40.500000000000306,{"$error":"#VALUE!"},{"$error":"#VALUE!"},null,null,null,null,null,null,null,null,null,null,null,null,null,null,null,null,{"$f":"'Input Screen'!$C$8*5280*$AU$4*'Input Screen'!$C$9*2*(T410-$T$6)/12*0.0575","v":{"$error":"#DIV/0!"}},{"$error":"#DIV/0!"},{"$f":"AS410/($AU$4*'Input Screen'!$C$8)","v":{"$error":"#DIV/0!"}},{"$error":"#DIV/0!"},{"$error":"#DIV/0!"},{"$f":"AS410*'Input Screen'!$C$21/1000000","v":{"$error":"#DIV/0!"}}]
[null,null,null,null,null,null,null,null,null,null,null,null,null,null,null,null,null,null,null,{"$error":"#DIV/0!"},{"$f":"'Input Screen'!$C$8*5280*'Input Screen'!$C$9*2*(T411-$T$6)/12*0.0575","v":{"$error":"#DIV/0!"}},{"$f":"U411/'Input Screen'!$C$8","v":{"$error":"#DIV/0!"}},{"$error":"#DIV/0!"},{"$error":"#DIV/0!"},{"$f":"U411*'Input Screen'!$C$21/1000000","v":{"$error":"#DIV/0!"}},40.600000000000307,{"$error":"#VALUE!"},{"$error":"#VALUE!"},null,null,null,null,null,null,null,null,null,null,null,null,null,null,null,null,{"$f":"'Input Screen'!$C$8*5280*$AU$4*'Input Screen'!$C$9*2*(T411-$T$6)/12*0.0575","v":{"$error":"#DIV/0!"}},{"$error":"#DIV/0!"},{"$f":"AS411/($AU$4*'Input Screen'!$C$8)","v":{"$error":"#DIV/0!"}},{"$error":"#DIV/0!"},{"$error":"#DIV/0!"},{"$f":"AS411*'Input Screen'!$C$21/1000000","v":{"$error":"#DIV/0!"}}]
[null,null,null,null,null,null,null,null,null,null,null,null,null,null,null,null,null,null,null,{"$error":"#DIV/0!"},{"$f":"'Input Screen'!$C$8*5280*'Input Screen'!$C$9*2*(T412-$T$6)/12*0.0575","v":{"$error":"#DIV/0!"}},{"$f":"U412/'Input Screen'!$C$8","v":{"$error":"#DIV/0!"}},{"$error":"#DIV/0!"},{"$error":"#DIV/0!"},{"$f":"U412*'Input Screen'!$C$21/1000000","v":{"$error":"#DIV/0!"}},40.700000000000308,{"$error":"#VALUE!"},{"$error":"#VALUE!"},null,null,null,null,null,null,null,null,null,null,null,null,null,null,null,null,{"$f":"'Input Screen'!$C$8*5280*$AU$4*'Input Screen'!$C$9*2*(T412-$T$6)/12*0.0575","v":{"$error":"#DIV/0!"}},{"$error":"#DIV/0!"},{"$f":"AS412/($AU$4*'Input Screen'!$C$8)","v":{"$error":"#DIV/0!"}},{"$error":"#DIV/0!"},{"$error":"#DIV/0!"},{"$f":"AS412*'Input Screen'!$C$21/1000000","v":{"$error":"#DIV/0!"}}]
[null,null,null,null,null,null,null,null,null,null,null,null,null,null,null,null,null,null,null,{"$error":"#DIV/0!"},{"$f":"'Input Screen'!$C$8*5280*'Input Screen'!$C$9*2*(T413-$T$6)/12*0.0575","v":{"$error":"#DIV/0!"}},{"$f":"U413/'Input Screen'!$C$8","v":{"$error":"#DIV/0!"}},{"$error":"#DIV/0!"},{"$error":"#DIV/0!"},{"$f":"U413*'Input Screen'!$C$21/1000000","v":{"$error":"#DIV/0!"}},40.80000000000031,{"$error":"#VALUE!"},{"$error":"#VALUE!"},null,null,null,null,null,null,null,null,null,null,null,null,null,null,null,null,{"$f":"'Input Screen'!$C$8*5280*$AU$4*'Input Screen'!$C$9*2*(T413-$T$6)/12*0.0575","v":{"$error":"#DIV/0!"}},{"$error":"#DIV/0!"},{"$f":"AS413/($AU$4*'Input Screen'!$C$8)","v":{"$error":"#DIV/0!"}},{"$error":"#DIV/0!"},{"$error":"#DIV/0!"},{"$f":"AS413*'Input Screen'!$C$21/1000000","v":{"$error":"#DIV/0!"}}]
[null,null,null,null,null,null,null,null,null,null,null,null,null,null,null,null,null,null,null,{"$error":"#DIV/0!"},{"$f":"'Input Screen'!$C$8*5280*'Input Screen'!$C$9*2*(T414-$T$6)/12*0.0575","v":{"$error":"#DIV/0!"}},{"$f":"U414/'Input Screen'!$C$8","v":{"$error":"#DIV/0!"}},{"$error":"#DIV/0!"},{"$error":"#DIV/0!"},{"$f":"U414*'Input Screen'!$C$21/1000000","v":{"$error":"#DIV/0!"}},40.900000000000311,{"$error":"#VALUE!"},{"$error":"#VALUE!"},null,null,null,null,null,null,null,null,null,null,null,null,null,null,null,null,{"$f":"'Input Screen'!$C$8*5280*$AU$4*'Input Screen'!$C$9*2*(T414-$T$6)/12*0.0575","v":{"$error":"#DIV/0!"}},{"$error":"#DIV/0!"},{"$f":"AS414/($AU$4*'Input Screen'!$C$8)","v":{"$error":"#DIV/0!"}},{"$error":"#DIV/0!"},{"$error":"#DIV/0!"},{"$f":"AS414*'Input Screen'!$C$21/1000000","v":{"$error":"#DIV/0!"}}]
[null,null,null,null,null,null,null,null,null,null,null,null,null,null,null,null,null,null,null,{"$error":"#DIV/0!"},{"$f":"'Input Screen'!$C$8*5280*'Input Screen'!$C$9*2*(T415-$T$6)/12*0.0575","v":{"$error":"#DIV/0!"}},{"$f":"U415/'Input Screen'!$C$8","v":{"$error":"#DIV/0!"}},{"$error":"#DIV/0!"},{"$error":"#DIV/0!"},{"$f":"U415*'Input Screen'!$C$21/1000000","v":{"$error":"#DIV/0!"}},41.000000000000313,{"$error":"#VALUE!"},{"$error":"#VALUE!"},null,null,null,null,null,null,null,null,null,null,null,null,null,null,null,null,{"$f":"'Input Screen'!$C$8*5280*$AU$4*'Input Screen'!$C$9*2*(T415-$T$6)/12*0.0575","v":{"$error":"#DIV/0!"}},{"$error":"#DIV/0!"},{"$f":"AS415/($AU$4*'Input Screen'!$C$8)","v":{"$error":"#DIV/0!"}},{"$error":"#DIV/0!"},{"$error":"#DIV/0!"},{"$f":"AS415*'Input Screen'!$C$21/1000000","v":{"$error":"#DIV/0!"}}]
[null,null,null,null,null,null,null,null,null,null,null,null,null,null,null,null,null,null,null,{"$error":"#DIV/0!"},{"$f":"'Input Screen'!$C$8*5280*'Input Screen'!$C$9*2*(T416-$T$6)/12*0.0575","v":{"$error":"#DIV/0!"}},{"$f":"U416/'Input Screen'!$C$8","v":{"$error":"#DIV/0!"}},{"$error":"#DIV/0!"},{"$error":"#DIV/0!"},{"$f":"U416*'Input Screen'!$C$21/1000000","v":{"$error":"#DIV/0!"}},41.100000000000314,{"$error":"#VALUE!"},{"$error":"#VALUE!"},null,null,null,null,null,null,null,null,null,null,null,null,null,null,null,null,{"$f":"'Input Screen'!$C$8*5280*$AU$4*'Input Screen'!$C$9*2*(T416-$T$6)/12*0.0575","v":{"$error":"#DIV/0!"}},{"$error":"#DIV/0!"},{"$f":"AS416/($AU$4*'Input Screen'!$C$8)","v":{"$error":"#DIV/0!"}},{"$error":"#DIV/0!"},{"$error":"#DIV/0!"},{"$f":"AS416*'Input Screen'!$C$21/1000000","v":{"$error":"#DIV/0!"}}]
[null,null,null,null,null,null,null,null,null,null,null,null,null,null,null,null,null,null,null,{"$error":"#DIV/0!"},{"$f":"'Input Screen'!$C$8*5280*'Input Screen'!$C$9*2*(T417-$T$6)/12*0.0575","v":{"$error":"#DIV/0!"}},{"$f":"U417/'Input Screen'!$C$8","v":{"$error":"#DIV/0!"}},{"$error":"#DIV/0!"},{"$error":"#DIV/0!"},{"$f":"U417*'Input Screen'!$C$21/1000000","v":{"$error":"#DIV/0!"}},41.200000000000315,{"$error":"#VALUE!"},{"$error":"#VALUE!"},null,null,null,null,null,null,null,null,null,null,null,null,null,null,null,null,{"$f":"'Input Screen'!$C$8*5280*$AU$4*'Input Screen'!$C$9*2*(T417-$T$6)/12*0.0575","v":{"$error":"#DIV/0!"}},{"$error":"#DIV/0!"},{"$f":"AS417/($AU$4*'Input Screen'!$C$8)","v":{"$error":"#DIV/0!"}},{"$error":"#DIV/0!"},{"$error":"#DIV/0!"},{"$f":"AS417*'Input Screen'!$C$21/1000000","v":{"$error":"#DIV/0!"}}]
[null,null,null,null,null,null,null,null,null,null,null,null,null,null,null,null,null,null,null,{"$error":"#DIV/0!"},{"$f":"'Input Screen'!$C$8*5280*'Input Screen'!$C$9*2*(T418-$T$6)/12*0.0575","v":{"$error":"#DIV/0!"}},{"$f":"U418/'Input Screen'!$C$8","v":{"$error":"#DIV/0!"}},{"$error":"#DIV/0!"},{"$error":"#DIV/0!"},{"$f":"U418*'Input Screen'!$C$21/1000000","v":{"$error":"#DIV/0!"}},41.300000000000317,{"$error":"#VALUE!"},{"$error":"#VALUE!"},null,null,null,null,null,null,null,null,null,null,null,null,null,null,null,null,{"$f":"'Input Screen'!$C$8*5280*$AU$4*'Input Screen'!$C$9*2*(T418-$T$6)/12*0.0575","v":{"$error":"#DIV/0!"}},{"$error":"#DIV/0!"},{"$f":"AS418/($AU$4*'Input Screen'!$C$8)","v":{"$error":"#DIV/0!"}},{"$error":"#DIV/0!"},{"$error":"#DIV/0!"},{"$f":"AS418*'Input Screen'!$C$21/1000000","v":{"$error":"#DIV/0!"}}]
[null,null,null,null,null,null,null,null,null,null,null,null,null,null,null,null,null,null,null,{"$error":"#DIV/0!"},{"$f":"'Input Screen'!$C$8*5280*'Input Screen'!$C$9*2*(T419-$T$6)/12*0.0575","v":{"$error":"#DIV/0!"}},{"$f":"U419/'Input Screen'!$C$8","v":{"$error":"#DIV/0!"}},{"$error":"#DIV/0!"},{"$error":"#DIV/0!"},{"$f":"U419*'Input Screen'!$C$21/1000000","v":{"$error":"#DIV/0!"}},41.400000000000318,{"$error":"#VALUE!"},{"$error":"#VALUE!"},null,null,null,null,null,null,null,null,null,null,null,null,null,null,null,null,{"$f":"'Input Screen'!$C$8*5280*$AU$4*'Input Screen'!$C$9*2*(T419-$T$6)/12*0.0575","v":{"$error":"#DIV/0!"}},{"$error":"#DIV/0!"},{"$f":"AS419/($AU$4*'Input Screen'!$C$8)","v":{"$error":"#DIV/0!"}},{"$error":"#DIV/0!"},{"$error":"#DIV/0!"},{"$f":"AS419*'Input Screen'!$C$21/1000000","v":{"$error":"#DIV/0!"}}]
[null,null,null,null,null,null,null,null,null,null,null,null,null,null,null,null,null,null,null,{"$error":"#DIV/0!"},{"$f":"'Input Screen'!$C$8*5280*'Input Screen'!$C$9*2*(T420-$T$6)/12*0.0575","v":{"$error":"#DIV/0!"}},{"$f":"U420/'Input Screen'!$C$8","v":{"$error":"#DIV/0!"}},{"$error":"#DIV/0!"},{"$error":"#DIV/0!"},{"$f":"U420*'Input Screen'!$C$21/1000000","v":{"$error":"#DIV/0!"}},41.50000000000032,{"$error":"#VALUE!"},{"$error":"#VALUE!"},null,null,null,null,null,null,null,null,null,null,null,null,null,null,null,null,{"$f":"'Input Screen'!$C$8*5280*$AU$4*'Input Screen'!$C$9*2*(T420-$T$6)/12*0.0575","v":{"$error":"#DIV/0!"}},{"$error":"#DIV/0!"},{"$f":"AS420/($AU$4*'Input Screen'!$C$8)","v":{"$error":"#DIV/0!"}},{"$error":"#DIV/0!"},{"$error":"#DIV/0!"},{"$f":"AS420*'Input Screen'!$C$21/1000000","v":{"$error":"#DIV/0!"}}]
[null,null,null,null,null,null,null,null,null,null,null,null,null,null,null,null,null,null,null,{"$error":"#DIV/0!"},{"$f":"'Input Screen'!$C$8*5280*'Input Screen'!$C$9*2*(T421-$T$6)/12*0.0575","v":{"$error":"#DIV/0!"}},{"$f":"U421/'Input Screen'!$C$8","v":{"$error":"#DIV/0!"}},{"$error":"#DIV/0!"},{"$error":"#DIV/0!"},{"$f":"U421*'Input Screen'!$C$21/1000000","v":{"$error":"#DIV/0!"}},41.600000000000321,{"$error":"#VALUE!"},{"$error":"#VALUE!"},null,null,null,null,null,null,null,null,null,null,null,null,null,null,null,null,{"$f":"'Input Screen'!$C$8*5280*$AU$4*'Input Screen'!$C$9*2*(T421-$T$6)/12*0.0575","v":{"$error":"#DIV/0!"}},{"$error":"#DIV/0!"},{"$f":"AS421/($AU$4*'Input Screen'!$C$8)","v":{"$error":"#DIV/0!"}},{"$error":"#DIV/0!"},{"$error":"#DIV/0!"},{"$f":"AS421*'Input Screen'!$C$21/1000000","v":{"$error":"#DIV/0!"}}]
[null,null,null,null,null,null,null,null,null,null,null,null,null,null,null,null,null,null,null,{"$error":"#DIV/0!"},{"$f":"'Input Screen'!$C$8*5280*'Input Screen'!$C$9*2*(T422-$T$6)/12*0.0575","v":{"$error":"#DIV/0!"}},{"$f":"U422/'Input Screen'!$C$8","v":{"$error":"#DIV/0!"}},{"$error":"#DIV/0!"},{"$error":"#DIV/0!"},{"$f":"U422*'Input Screen'!$C$21/1000000","v":{"$error":"#DIV/0!"}},41.700000000000323,{"$error":"#VALUE!"},{"$error":"#VALUE!"},null,null,null,null,null,null,null,null,null,null,null,null,null,null,null,null,{"$f":"'Input Screen'!$C$8*5280*$AU$4*'Input Screen'!$C$9*2*(T422-$T$6)/12*0.0575","v":{"$error":"#DIV/0!"}},{"$error":"#DIV/0!"},{"$f":"AS422/($AU$4*'Input Screen'!$C$8)","v":{"$error":"#DIV/0!"}},{"$error":"#DIV/0!"},{"$error":"#DIV/0!"},{"$f":"AS422*'Input Screen'!$C$21/1000000","v":{"$error":"#DIV/0!"}}]
[null,null,null,null,null,null,null,null,null,null,null,null,null,null,null,null,null,null,null,{"$error":"#DIV/0!"},{"$f":"'Input Screen'!$C$8*5280*'Input Screen'!$C$9*2*(T423-$T$6)/12*0.0575","v":{"$error":"#DIV/0!"}},{"$f":"U423/'Input Screen'!$C$8","v":{"$error":"#DIV/0!"}},{"$error":"#DIV/0!"},{"$error":"#DIV/0!"},{"$f":"U423*'Input Screen'!$C$21/1000000","v":{"$error":"#DIV/0!"}},41.800000000000324,{"$error":"#VALUE!"},{"$error":"#VALUE!"},null,null,null,null,null,null,null,null,null,null,null,null,null,null,null,null,{"$f":"'Input Screen'!$C$8*5280*$AU$4*'Input Screen'!$C$9*2*(T423-$T$6)/12*0.0575","v":{"$error":"#DIV/0!"}},{"$error":"#DIV/0!"},{"$f":"AS423/($AU$4*'Input Screen'!$C$8)","v":{"$error":"#DIV/0!"}},{"$error":"#DIV/0!"},{"$error":"#DIV/0!"},{"$f":"AS423*'Input Screen'!$C$21/1000000","v":{"$error":"#DIV/0!"}}]
[null,null,null,null,null,null,null,null,null,null,null,null,null,null,null,null,null,null,null,{"$error":"#DIV/0!"},{"$f":"'Input Screen'!$C$8*5280*'Input Screen'!$C$9*2*(T424-$T$6)/12*0.0575","v":{"$error":"#DIV/0!"}},{"$f":"U424/'Input Screen'!$C$8","v":{"$error":"#DIV/0!"}},{"$error":"#DIV/0!"},{"$error":"#DIV/0!"},{"$f":"U424*'Input Screen'!$C$21/1000000","v":{"$error":"#DIV/0!"}},41.900000000000325,{"$error":"#VALUE!"},{"$error":"#VALUE!"},null,null,null,null,null,null,null,null,null,null,null,null,null,null,null,null,{"$f":"'Input Screen'!$C$8*5280*$AU$4*'Input Screen'!$C$9*2*(T424-$T$6)/12*0.0575","v":{"$error":"#DIV/0!"}},{"$error":"#DIV/0!"},{"$f":"AS424/($AU$4*'Input Screen'!$C$8)","v":{"$error":"#DIV/0!"}},{"$error":"#DIV/0!"},{"$error":"#DIV/0!"},{"$f":"AS424*'Input Screen'!$C$21/1000000","v":{"$error":"#DIV/0!"}}]
[null,null,null,null,null,null,null,null,null,null,null,null,null,null,null,null,null,null,null,{"$error":"#DIV/0!"},{"$f":"'Input Screen'!$C$8*5280*'Input Screen'!$C$9*2*(T425-$T$6)/12*0.0575","v":{"$error":"#DIV/0!"}},{"$f":"U425/'Input Screen'!$C$8","v":{"$error":"#DIV/0!"}},{"$error":"#DIV/0!"},{"$error":"#DIV/0!"},{"$f":"U425*'Input Screen'!$C$21/1000000","v":{"$error":"#DIV/0!"}},42.000000000000327,{"$error":"#VALUE!"},{"$error":"#VALUE!"},null,null,null,null,null,null,null,null,null,null,null,null,null,null,null,null,{"$f":"'Input Screen'!$C$8*5280*$AU$4*'Input Screen'!$C$9*2*(T425-$T$6)/12*0.0575","v":{"$error":"#DIV/0!"}},{"$error":"#DIV/0!"},{"$f":"AS425/($AU$4*'Input Screen'!$C$8)","v":{"$error":"#DIV/0!"}},{"$error":"#DIV/0!"},{"$error":"#DIV/0!"},{"$f":"AS425*'Input Screen'!$C$21/1000000","v":{"$error":"#DIV/0!"}}]
[null,null,null,null,null,null,null,null,null,null,null,null,null,null,null,null,null,null,null,{"$error":"#DIV/0!"},{"$f":"'Input Screen'!$C$8*5280*'Input Screen'!$C$9*2*(T426-$T$6)/12*0.0575","v":{"$error":"#DIV/0!"}},{"$f":"U426/'Input Screen'!$C$8","v":{"$error":"#DIV/0!"}},{"$error":"#DIV/0!"},{"$error":"#DIV/0!"},{"$f":"U426*'Input Screen'!$C$21/1000000","v":{"$error":"#DIV/0!"}},42.100000000000328,{"$error":"#VALUE!"},{"$error":"#VALUE!"},null,null,null,null,null,null,null,null,null,null,null,null,null,null,null,null,{"$f":"'Input Screen'!$C$8*5280*$AU$4*'Input Screen'!$C$9*2*(T426-$T$6)/12*0.0575","v":{"$error":"#DIV/0!"}},{"$error":"#DIV/0!"},{"$f":"AS426/($AU$4*'Input Screen'!$C$8)","v":{"$error":"#DIV/0!"}},{"$error":"#DIV/0!"},{"$error":"#DIV/0!"},{"$f":"AS426*'Input Screen'!$C$21/1000000","v":{"$error":"#DIV/0!"}}]
[null,null,null,null,null,null,null,null,null,null,null,null,null,null,null,null,null,null,null,{"$error":"#DIV/0!"},{"$f":"'Input Screen'!$C$8*5280*'Input Screen'!$C$9*2*(T427-$T$6)/12*0.0575","v":{"$error":"#DIV/0!"}},{"$f":"U427/'Input Screen'!$C$8","v":{"$error":"#DIV/0!"}},{"$error":"#DIV/0!"},{"$error":"#DIV/0!"},{"$f":"U427*'Input Screen'!$C$21/1000000","v":{"$error":"#DIV/0!"}},42.20000000000033,{"$error":"#VALUE!"},{"$error":"#VALUE!"},null,null,null,null,null,null,null,null,null,null,null,null,null,null,null,null,{"$f":"'Input Screen'!$C$8*5280*$AU$4*'Input Screen'!$C$9*2*(T427-$T$6)/12*0.0575","v":{"$error":"#DIV/0!"}},{"$error":"#DIV/0!"},{"$f":"AS427/($AU$4*'Input Screen'!$C$8)","v":{"$error":"#DIV/0!"}},{"$error":"#DIV/0!"},{"$error":"#DIV/0!"},{"$f":"AS427*'Input Screen'!$C$21/1000000","v":{"$error":"#DIV/0!"}}]
[null,null,null,null,null,null,null,null,null,null,null,null,null,null,null,null,null,null,null,{"$error":"#DIV/0!"},{"$f":"'Input Screen'!$C$8*5280*'Input Screen'!$C$9*2*(T428-$T$6)/12*0.0575","v":{"$error":"#DIV/0!"}},{"$f":"U428/'Input Screen'!$C$8","v":{"$error":"#DIV/0!"}},{"$error":"#DIV/0!"},{"$error":"#DIV/0!"},{"$f":"U428*'Input Screen'!$C$21/1000000","v":{"$error":"#DIV/0!"}},42.300000000000331,{"$error":"#VALUE!"},{"$error":"#VALUE!"},null,null,null,null,null,null,null,null,null,null,null,null,null,null,null,null,{"$f":"'Input Screen'!$C$8*5280*$AU$4*'Input Screen'!$C$9*2*(T428-$T$6)/12*0.0575","v":{"$error":"#DIV/0!"}},{"$error":"#DIV/0!"},{"$f":"AS428/($AU$4*'Input Screen'!$C$8)","v":{"$error":"#DIV/0!"}},{"$error":"#DIV/0!"},{"$error":"#DIV/0!"},{"$f":"AS428*'Input Screen'!$C$21/1000000","v":{"$error":"#DIV/0!"}}]
[null,null,null,null,null,null,null,null,null,null,null,null,null,null,null,null,null,null,null,{"$error":"#DIV/0!"},{"$f":"'Input Screen'!$C$8*5280*'Input Screen'!$C$9*2*(T429-$T$6)/12*0.0575","v":{"$error":"#DIV/0!"}},{"$f":"U429/'Input Screen'!$C$8","v":{"$error":"#DIV/0!"}},{"$error":"#DIV/0!"},{"$error":"#DIV/0!"},{"$f":"U429*'Input Screen'!$C$21/1000000","v":{"$error":"#DIV/0!"}},42.400000000000333,{"$error":"#VALUE!"},{"$error":"#VALUE!"},null,null,null,null,null,null,null,null,null,null,null,null,null,null,null,null,{"$f":"'Input Screen'!$C$8*5280*$AU$4*'Input Screen'!$C$9*2*(T429-$T$6)/12*0.0575","v":{"$error":"#DIV/0!"}},{"$error":"#DIV/0!"},{"$f":"AS429/($AU$4*'Input Screen'!$C$8)","v":{"$error":"#DIV/0!"}},{"$error":"#DIV/0!"},{"$error":"#DIV/0!"},{"$f":"AS429*'Input Screen'!$C$21/1000000","v":{"$error":"#DIV/0!"}}]
[null,null,null,null,null,null,null,null,null,null,null,null,null,null,null,null,null,null,null,{"$error":"#DIV/0!"},{"$f":"'Input Screen'!$C$8*5280*'Input Screen'!$C$9*2*(T430-$T$6)/12*0.0575","v":{"$error":"#DIV/0!"}},{"$f":"U430/'Input Screen'!$C$8","v":{"$error":"#DIV/0!"}},{"$error":"#DIV/0!"},{"$error":"#DIV/0!"},{"$f":"U430*'Input Screen'!$C$21/1000000","v":{"$error":"#DIV/0!"}},42.500000000000334,{"$error":"#VALUE!"},{"$error":"#VALUE!"},null,null,null,null,null,null,null,null,null,null,null,null,null,null,null,null,{"$f":"'Input Screen'!$C$8*5280*$AU$4*'Input Screen'!$C$9*2*(T430-$T$6)/12*0.0575","v":{"$error":"#DIV/0!"}},{"$error":"#DIV/0!"},{"$f":"AS430/($AU$4*'Input Screen'!$C$8)","v":{"$error":"#DIV/0!"}},{"$error":"#DIV/0!"},{"$error":"#DIV/0!"},{"$f":"AS430*'Input Screen'!$C$21/1000000","v":{"$error":"#DIV/0!"}}]
[null,null,null,null,null,null,null,null,null,null,null,null,null,null,null,null,null,null,null,{"$error":"#DIV/0!"},{"$f":"'Input Screen'!$C$8*5280*'Input Screen'!$C$9*2*(T431-$T$6)/12*0.0575","v":{"$error":"#DIV/0!"}},{"$f":"U431/'Input Screen'!$C$8","v":{"$error":"#DIV/0!"}},{"$error":"#DIV/0!"},{"$error":"#DIV/0!"},{"$f":"U431*'Input Screen'!$C$21/1000000","v":{"$error":"#DIV/0!"}},42.600000000000335,{"$error":"#VALUE!"},{"$error":"#VALUE!"},null,null,null,null,null,null,null,null,null,null,null,null,null,null,null,null,{"$f":"'Input Screen'!$C$8*5280*$AU$4*'Input Screen'!$C$9*2*(T431-$T$6)/12*0.0575","v":{"$error":"#DIV/0!"}},{"$error":"#DIV/0!"},{"$f":"AS431/($AU$4*'Input Screen'!$C$8)","v":{"$error":"#DIV/0!"}},{"$error":"#DIV/0!"},{"$error":"#DIV/0!"},{"$f":"AS431*'Input Screen'!$C$21/1000000","v":{"$error":"#DIV/0!"}}]
[null,null,null,null,null,null,null,null,null,null,null,null,null,null,null,null,null,null,null,{"$error":"#DIV/0!"},{"$f":"'Input Screen'!$C$8*5280*'Input Screen'!$C$9*2*(T432-$T$6)/12*0.0575","v":{"$error":"#DIV/0!"}},{"$f":"U432/'Input Screen'!$C$8","v":{"$error":"#DIV/0!"}},{"$error":"#DIV/0!"},{"$error":"#DIV/0!"},{"$f":"U432*'Input Screen'!$C$21/1000000","v":{"$error":"#DIV/0!"}},42.700000000000337,{"$error":"#VALUE!"},{"$error":"#VALUE!"},null,null,null,null,null,null,null,null,null,null,null,null,null,null,null,null,{"$f":"'Input Screen'!$C$8*5280*$AU$4*'Input Screen'!$C$9*2*(T432-$T$6)/12*0.0575","v":{"$error":"#DIV/0!"}},{"$error":"#DIV/0!"},{"$f":"AS432/($AU$4*'Input Screen'!$C$8)","v":{"$error":"#DIV/0!"}},{"$error":"#DIV/0!"},{"$error":"#DIV/0!"},{"$f":"AS432*'Input Screen'!$C$21/1000000","v":{"$error":"#DIV/0!"}}]
[null,null,null,null,null,null,null,null,null,null,null,null,null,null,null,null,null,null,null,{"$error":"#DIV/0!"},{"$f":"'Input Screen'!$C$8*5280*'Input Screen'!$C$9*2*(T433-$T$6)/12*0.0575","v":{"$error":"#DIV/0!"}},{"$f":"U433/'Input Screen'!$C$8","v":{"$error":"#DIV/0!"}},{"$error":"#DIV/0!"},{"$error":"#DIV/0!"},{"$f":"U433*'Input Screen'!$C$21/1000000","v":{"$error":"#DIV/0!"}},42.800000000000338,{"$error":"#VALUE!"},{"$error":"#VALUE!"},null,null,null,null,null,null,null,null,null,null,null,null,null,null,null,null,{"$f":"'Input Screen'!$C$8*5280*$AU$4*'Input Screen'!$C$9*2*(T433-$T$6)/12*0.0575","v":{"$error":"#DIV/0!"}},{"$error":"#DIV/0!"},{"$f":"AS433/($AU$4*'Input Screen'!$C$8)","v":{"$error":"#DIV/0!"}},{"$error":"#DIV/0!"},{"$error":"#DIV/0!"},{"$f":"AS433*'Input Screen'!$C$21/1000000","v":{"$error":"#DIV/0!"}}]
[null,null,null,null,null,null,null,null,null,null,null,null,null,null,null,null,null,null,null,{"$error":"#DIV/0!"},{"$f":"'Input Screen'!$C$8*5280*'Input Screen'!$C$9*2*(T434-$T$6)/12*0.0575","v":{"$error":"#DIV/0!"}},{"$f":"U434/'Input Screen'!$C$8","v":{"$error":"#DIV/0!"}},{"$error":"#DIV/0!"},{"$error":"#DIV/0!"},{"$f":"U434*'Input Screen'!$C$21/1000000","v":{"$error":"#DIV/0!"}},42.90000000000034,{"$error":"#VALUE!"},{"$error":"#VALUE!"},null,null,null,null,null,null,null,null,null,null,null,null,null,null,null,null,{"$f":"'Input Screen'!$C$8*5280*$AU$4*'Input Screen'!$C$9*2*(T434-$T$6)/12*0.0575","v":{"$error":"#DIV/0!"}},{"$error":"#DIV/0!"},{"$f":"AS434/($AU$4*'Input Screen'!$C$8)","v":{"$error":"#DIV/0!"}},{"$error":"#DIV/0!"},{"$error":"#DIV/0!"},{"$f":"AS434*'Input Screen'!$C$21/1000000","v":{"$error":"#DIV/0!"}}]
[null,null,null,null,null,null,null,null,null,null,null,null,null,null,null,null,null,null,null,{"$error":"#DIV/0!"},{"$f":"'Input Screen'!$C$8*5280*'Input Screen'!$C$9*2*(T435-$T$6)/12*0.0575","v":{"$error":"#DIV/0!"}},{"$f":"U435/'Input Screen'!$C$8","v":{"$error":"#DIV/0!"}},{"$error":"#DIV/0!"},{"$error":"#DIV/0!"},{"$f":"U435*'Input Screen'!$C$21/1000000","v":{"$error":"#DIV/0!"}},43.000000000000341,{"$error":"#VALUE!"},{"$error":"#VALUE!"},null,null,null,null,null,null,null,null,null,null,null,null,null,null,null,null,{"$f":"'Input Screen'!$C$8*5280*$AU$4*'Input Screen'!$C$9*2*(T435-$T$6)/12*0.0575","v":{"$error":"#DIV/0!"}},{"$error":"#DIV/0!"},{"$f":"AS435/($AU$4*'Input Screen'!$C$8)","v":{"$error":"#DIV/0!"}},{"$error":"#DIV/0!"},{"$error":"#DIV/0!"},{"$f":"AS435*'Input Screen'!$C$21/1000000","v":{"$error":"#DIV/0!"}}]
[null,null,null,null,null,null,null,null,null,null,null,null,null,null,null,null,null,null,null,{"$error":"#DIV/0!"},{"$f":"'Input Screen'!$C$8*5280*'Input Screen'!$C$9*2*(T436-$T$6)/12*0.0575","v":{"$error":"#DIV/0!"}},{"$f":"U436/'Input Screen'!$C$8","v":{"$error":"#DIV/0!"}},{"$error":"#DIV/0!"},{"$error":"#DIV/0!"},{"$f":"U436*'Input Screen'!$C$21/1000000","v":{"$error":"#DIV/0!"}},43.100000000000342,{"$error":"#VALUE!"},{"$error":"#VALUE!"},null,null,null,null,null,null,null,null,null,null,null,null,null,null,null,null,{"$f":"'Input Screen'!$C$8*5280*$AU$4*'Input Screen'!$C$9*2*(T436-$T$6)/12*0.0575","v":{"$error":"#DIV/0!"}},{"$error":"#DIV/0!"},{"$f":"AS436/($AU$4*'Input Screen'!$C$8)","v":{"$error":"#DIV/0!"}},{"$error":"#DIV/0!"},{"$error":"#DIV/0!"},{"$f":"AS436*'Input Screen'!$C$21/1000000","v":{"$error":"#DIV/0!"}}]
[null,null,null,null,null,null,null,null,null,null,null,null,null,null,null,null,null,null,null,{"$error":"#DIV/0!"},{"$f":"'Input Screen'!$C$8*5280*'Input Screen'!$C$9*2*(T437-$T$6)/12*0.0575","v":{"$error":"#DIV/0!"}},{"$f":"U437/'Input Screen'!$C$8","v":{"$error":"#DIV/0!"}},{"$error":"#DIV/0!"},{"$error":"#DIV/0!"},{"$f":"U437*'Input Screen'!$C$21/1000000","v":{"$error":"#DIV/0!"}},43.200000000000344,{"$error":"#VALUE!"},{"$error":"#VALUE!"},null,null,null,null,null,null,null,null,null,null,null,null,null,null,null,null,{"$f":"'Input Screen'!$C$8*5280*$AU$4*'Input Screen'!$C$9*2*(T437-$T$6)/12*0.0575","v":{"$error":"#DIV/0!"}},{"$error":"#DIV/0!"},{"$f":"AS437/($AU$4*'Input Screen'!$C$8)","v":{"$error":"#DIV/0!"}},{"$error":"#DIV/0!"},{"$error":"#DIV/0!"},{"$f":"AS437*'Input Screen'!$C$21/1000000","v":{"$error":"#DIV/0!"}}]
[null,null,null,null,null,null,null,null,null,null,null,null,null,null,null,null,null,null,null,{"$error":"#DIV/0!"},{"$f":"'Input Screen'!$C$8*5280*'Input Screen'!$C$9*2*(T438-$T$6)/12*0.0575","v":{"$error":"#DIV/0!"}},{"$f":"U438/'Input Screen'!$C$8","v":{"$error":"#DIV/0!"}},{"$error":"#DIV/0!"},{"$error":"#DIV/0!"},{"$f":"U438*'Input Screen'!$C$21/1000000","v":{"$error":"#DIV/0!"}},43.300000000000345,{"$error":"#VALUE!"},{"$error":"#VALUE!"},null,null,null,null,null,null,null,null,null,null,null,null,null,null,null,null,{"$f":"'Input Screen'!$C$8*5280*$AU$4*'Input Screen'!$C$9*2*(T438-$T$6)/12*0.0575","v":{"$error":"#DIV/0!"}},{"$error":"#DIV/0!"},{"$f":"AS438/($AU$4*'Input Screen'!$C$8)","v":{"$error":"#DIV/0!"}},{"$error":"#DIV/0!"},{"$error":"#DIV/0!"},{"$f":"AS438*'Input Screen'!$C$21/1000000","v":{"$error":"#DIV/0!"}}]
[null,null,null,null,null,null,null,null,null,null,null,null,null,null,null,null,null,null,null,{"$error":"#DIV/0!"},{"$f":"'Input Screen'!$C$8*5280*'Input Screen'!$C$9*2*(T439-$T$6)/12*0.0575","v":{"$error":"#DIV/0!"}},{"$f":"U439/'Input Screen'!$C$8","v":{"$error":"#DIV/0!"}},{"$error":"#DIV/0!"},{"$error":"#DIV/0!"},{"$f":"U439*'Input Screen'!$C$21/1000000","v":{"$error":"#DIV/0!"}},43.400000000000347,{"$error":"#VALUE!"},{"$error":"#VALUE!"},null,null,null,null,null,null,null,null,null,null,null,null,null,null,null,null,{"$f":"'Input Screen'!$C$8*5280*$AU$4*'Input Screen'!$C$9*2*(T439-$T$6)/12*0.0575","v":{"$error":"#DIV/0!"}},{"$error":"#DIV/0!"},{"$f":"AS439/($AU$4*'Input Screen'!$C$8)","v":{"$error":"#DIV/0!"}},{"$error":"#DIV/0!"},{"$error":"#DIV/0!"},{"$f":"AS439*'Input Screen'!$C$21/1000000","v":{"$error":"#DIV/0!"}}]
[null,null,null,null,null,null,null,null,null,null,null,null,null,null,null,null,null,null,null,{"$error":"#DIV/0!"},{"$f":"'Input Screen'!$C$8*5280*'Input Screen'!$C$9*2*(T440-$T$6)/12*0.0575","v":{"$error":"#DIV/0!"}},{"$f":"U440/'Input Screen'!$C$8","v":{"$error":"#DIV/0!"}},{"$error":"#DIV/0!"},{"$error":"#DIV/0!"},{"$f":"U440*'Input Screen'!$C$21/1000000","v":{"$error":"#DIV/0!"}},43.500000000000348,{"$error":"#VALUE!"},{"$error":"#VALUE!"},null,null,null,null,null,null,null,null,null,null,null,null,null,null,null,null,{"$f":"'Input Screen'!$C$8*5280*$AU$4*'Input Screen'!$C$9*2*(T440-$T$6)/12*0.0575","v":{"$error":"#DIV/0!"}},{"$error":"#DIV/0!"},{"$f":"AS440/($AU$4*'Input Screen'!$C$8)","v":{"$error":"#DIV/0!"}},{"$error":"#DIV/0!"},{"$error":"#DIV/0!"},{"$f":"AS440*'Input Screen'!$C$21/1000000","v":{"$error":"#DIV/0!"}}]
[null,null,null,null,null,null,null,null,null,null,null,null,null,null,null,null,null,null,null,{"$error":"#DIV/0!"},{"$f":"'Input Screen'!$C$8*5280*'Input Screen'!$C$9*2*(T441-$T$6)/12*0.0575","v":{"$error":"#DIV/0!"}},{"$f":"U441/'Input Screen'!$C$8","v":{"$error":"#DIV/0!"}},{"$error":"#DIV/0!"},{"$error":"#DIV/0!"},{"$f":"U441*'Input Screen'!$C$21/1000000","v":{"$error":"#DIV/0!"}},43.60000000000035,{"$error":"#VALUE!"},{"$error":"#VALUE!"},null,null,null,null,null,null,null,null,null,null,null,null,null,null,null,null,{"$f":"'Input Screen'!$C$8*5280*$AU$4*'Input Screen'!$C$9*2*(T441-$T$6)/12*0.0575","v":{"$error":"#DIV/0!"}},{"$error":"#DIV/0!"},{"$f":"AS441/($AU$4*'Input Screen'!$C$8)","v":{"$error":"#DIV/0!"}},{"$error":"#DIV/0!"},{"$error":"#DIV/0!"},{"$f":"AS441*'Input Screen'!$C$21/1000000","v":{"$error":"#DIV/0!"}}]
[null,null,null,null,null,null,null,null,null,null,null,null,null,null,null,null,null,null,null,{"$error":"#DIV/0!"},{"$f":"'Input Screen'!$C$8*5280*'Input Screen'!$C$9*2*(T442-$T$6)/12*0.0575","v":{"$error":"#DIV/0!"}},{"$f":"U442/'Input Screen'!$C$8","v":{"$error":"#DIV/0!"}},{"$error":"#DIV/0!"},{"$error":"#DIV/0!"},{"$f":"U442*'Input Screen'!$C$21/1000000","v":{"$error":"#DIV/0!"}},43.700000000000351,{"$error":"#VALUE!"},{"$error":"#VALUE!"},null,null,null,null,null,null,null,null,null,null,null,null,null,null,null,null,{"$f":"'Input Screen'!$C$8*5280*$AU$4*'Input Screen'!$C$9*2*(T442-$T$6)/12*0.0575","v":{"$error":"#DIV/0!"}},{"$error":"#DIV/0!"},{"$f":"AS442/($AU$4*'Input Screen'!$C$8)","v":{"$error":"#DIV/0!"}},{"$error":"#DIV/0!"},{"$error":"#DIV/0!"},{"$f":"AS442*'Input Screen'!$C$21/1000000","v":{"$error":"#DIV/0!"}}]
[null,null,null,null,null,null,null,null,null,null,null,null,null,null,null,null,null,null,null,{"$error":"#DIV/0!"},{"$f":"'Input Screen'!$C$8*5280*'Input Screen'!$C$9*2*(T443-$T$6)/12*0.0575","v":{"$error":"#DIV/0!"}},{"$f":"U443/'Input Screen'!$C$8","v":{"$error":"#DIV/0!"}},{"$error":"#DIV/0!"},{"$error":"#DIV/0!"},{"$f":"U443*'Input Screen'!$C$21/1000000","v":{"$error":"#DIV/0!"}},43.800000000000352,{"$error":"#VALUE!"},{"$error":"#VALUE!"},null,null,null,null,null,null,null,null,null,null,null,null,null,null,null,null,{"$f":"'Input Screen'!$C$8*5280*$AU$4*'Input Screen'!$C$9*2*(T443-$T$6)/12*0.0575","v":{"$error":"#DIV/0!"}},{"$error":"#DIV/0!"},{"$f":"AS443/($AU$4*'Input Screen'!$C$8)","v":{"$error":"#DIV/0!"}},{"$error":"#DIV/0!"},{"$error":"#DIV/0!"},{"$f":"AS443*'Input Screen'!$C$21/1000000","v":{"$error":"#DIV/0!"}}]
[null,null,null,null,null,null,null,null,null,null,null,null,null,null,null,null,null,null,null,{"$error":"#DIV/0!"},{"$f":"'Input Screen'!$C$8*5280*'Input Screen'!$C$9*2*(T444-$T$6)/12*0.0575","v":{"$error":"#DIV/0!"}},{"$f":"U444/'Input Screen'!$C$8","v":{"$error":"#DIV/0!"}},{"$error":"#DIV/0!"},{"$error":"#DIV/0!"},{"$f":"U444*'Input Screen'!$C$21/1000000","v":{"$error":"#DIV/0!"}},43.900000000000354,{"$error":"#VALUE!"},{"$error":"#VALUE!"},null,null,null,null,null,null,null,null,null,null,null,null,null,null,null,null,{"$f":"'Input Screen'!$C$8*5280*$AU$4*'Input Screen'!$C$9*2*(T444-$T$6)/12*0.0575","v":{"$error":"#DIV/0!"}},{"$error":"#DIV/0!"},{"$f":"AS444/($AU$4*'Input Screen'!$C$8)","v":{"$error":"#DIV/0!"}},{"$error":"#DIV/0!"},{"$error":"#DIV/0!"},{"$f":"AS444*'Input Screen'!$C$21/1000000","v":{"$error":"#DIV/0!"}}]
[null,null,null,null,null,null,null,null,null,null,null,null,null,null,null,null,null,null,null,{"$error":"#DIV/0!"},{"$f":"'Input Screen'!$C$8*5280*'Input Screen'!$C$9*2*(T445-$T$6)/12*0.0575","v":{"$error":"#DIV/0!"}},{"$f":"U445/'Input Screen'!$C$8","v":{"$error":"#DIV/0!"}},{"$error":"#DIV/0!"},{"$error":"#DIV/0!"},{"$f":"U445*'Input Screen'!$C$21/1000000","v":{"$error":"#DIV/0!"}},44.000000000000355,{"$error":"#VALUE!"},{"$error":"#VALUE!"},null,null,null,null,null,null,null,null,null,null,null,null,null,null,null,null,{"$f":"'Input Screen'!$C$8*5280*$AU$4*'Input Screen'!$C$9*2*(T445-$T$6)/12*0.0575","v":{"$error":"#DIV/0!"}},{"$error":"#DIV/0!"},{"$f":"AS445/($AU$4*'Input Screen'!$C$8)","v":{"$error":"#DIV/0!"}},{"$error":"#DIV/0!"},{"$error":"#DIV/0!"},{"$f":"AS445*'Input Screen'!$C$21/1000000","v":{"$error":"#DIV/0!"}}]
[null,null,null,null,null,null,null,null,null,null,null,null,null,null,null,null,null,null,null,{"$error":"#DIV/0!"},{"$f":"'Input Screen'!$C$8*5280*'Input Screen'!$C$9*2*(T446-$T$6)/12*0.0575","v":{"$error":"#DIV/0!"}},{"$f":"U446/'Input Screen'!$C$8","v":{"$error":"#DIV/0!"}},{"$error":"#DIV/0!"},{"$error":"#DIV/0!"},{"$f":"U446*'Input Screen'!$C$21/1000000","v":{"$error":"#DIV/0!"}},44.100000000000357,{"$error":"#VALUE!"},{"$error":"#VALUE!"},null,null,null,null,null,null,null,null,null,null,null,null,null,null,null,null,{"$f":"'Input Screen'!$C$8*5280*$AU$4*'Input Screen'!$C$9*2*(T446-$T$6)/12*0.0575","v":{"$error":"#DIV/0!"}},{"$error":"#DIV/0!"},{"$f":"AS446/($AU$4*'Input Screen'!$C$8)","v":{"$error":"#DIV/0!"}},{"$error":"#DIV/0!"},{"$error":"#DIV/0!"},{"$f":"AS446*'Input Screen'!$C$21/1000000","v":{"$error":"#DIV/0!"}}]
[null,null,null,null,null,null,null,null,null,null,null,null,null,null,null,null,null,null,null,{"$error":"#DIV/0!"},{"$f":"'Input Screen'!$C$8*5280*'Input Screen'!$C$9*2*(T447-$T$6)/12*0.0575","v":{"$error":"#DIV/0!"}},{"$f":"U447/'Input Screen'!$C$8","v":{"$error":"#DIV/0!"}},{"$error":"#DIV/0!"},{"$error":"#DIV/0!"},{"$f":"U447*'Input Screen'!$C$21/1000000","v":{"$error":"#DIV/0!"}},44.200000000000358,{"$error":"#VALUE!"},{"$error":"#VALUE!"},null,null,null,null,null,null,null,null,null,null,null,null,null,null,null,null,{"$f":"'Input Screen'!$C$8*5280*$AU$4*'Input Screen'!$C$9*2*(T447-$T$6)/12*0.0575","v":{"$error":"#DIV/0!"}},{"$error":"#DIV/0!"},{"$f":"AS447/($AU$4*'Input Screen'!$C$8)","v":{"$error":"#DIV/0!"}},{"$error":"#DIV/0!"},{"$error":"#DIV/0!"},{"$f":"AS447*'Input Screen'!$C$21/1000000","v":{"$error":"#DIV/0!"}}]
[null,null,null,null,null,null,null,null,null,null,null,null,null,null,null,null,null,null,null,{"$error":"#DIV/0!"},{"$f":"'Input Screen'!$C$8*5280*'Input Screen'!$C$9*2*(T448-$T$6)/12*0.0575","v":{"$error":"#DIV/0!"}},{"$f":"U448/'Input Screen'!$C$8","v":{"$error":"#DIV/0!"}},{"$error":"#DIV/0!"},{"$error":"#DIV/0!"},{"$f":"U448*'Input Screen'!$C$21/1000000","v":{"$error":"#DIV/0!"}},44.30000000000036,{"$error":"#VALUE!"},{"$error":"#VALUE!"},null,null,null,null,null,null,null,null,null,null,null,null,null,null,null,null,{"$f":"'Input Screen'!$C$8*5280*$AU$4*'Input Screen'!$C$9*2*(T448-$T$6)/12*0.0575","v":{"$error":"#DIV/0!"}},{"$error":"#DIV/0!"},{"$f":"AS448/($AU$4*'Input Screen'!$C$8)","v":{"$error":"#DIV/0!"}},{"$error":"#DIV/0!"},{"$error":"#DIV/0!"},{"$f":"AS448*'Input Screen'!$C$21/1000000","v":{"$error":"#DIV/0!"}}]
[null,null,null,null,null,null,null,null,null,null,null,null,null,null,null,null,null,null,null,{"$error":"#DIV/0!"},{"$f":"'Input Screen'!$C$8*5280*'Input Screen'!$C$9*2*(T449-$T$6)/12*0.0575","v":{"$error":"#DIV/0!"}},{"$f":"U449/'Input Screen'!$C$8","v":{"$error":"#DIV/0!"}},{"$error":"#DIV/0!"},{"$error":"#DIV/0!"},{"$f":"U449*'Input Screen'!$C$21/1000000","v":{"$error":"#DIV/0!"}},44.400000000000361,{"$error":"#VALUE!"},{"$error":"#VALUE!"},null,null,null,null,null,null,null,null,null,null,null,null,null,null,null,null,{"$f":"'Input Screen'!$C$8*5280*$AU$4*'Input Screen'!$C$9*2*(T449-$T$6)/12*0.0575","v":{"$error":"#DIV/0!"}},{"$error":"#DIV/0!"},{"$f":"AS449/($AU$4*'Input Screen'!$C$8)","v":{"$error":"#DIV/0!"}},{"$error":"#DIV/0!"},{"$error":"#DIV/0!"},{"$f":"AS449*'Input Screen'!$C$21/1000000","v":{"$error":"#DIV/0!"}}]
[null,null,null,null,null,null,null,null,null,null,null,null,null,null,null,null,null,null,null,{"$error":"#DIV/0!"},{"$f":"'Input Screen'!$C$8*5280*'Input Screen'!$C$9*2*(T450-$T$6)/12*0.0575","v":{"$error":"#DIV/0!"}},{"$f":"U450/'Input Screen'!$C$8","v":{"$error":"#DIV/0!"}},{"$error":"#DIV/0!"},{"$error":"#DIV/0!"},{"$f":"U450*'Input Screen'!$C$21/1000000","v":{"$error":"#DIV/0!"}},44.500000000000362,{"$error":"#VALUE!"},{"$error":"#VALUE!"},null,null,null,null,null,null,null,null,null,null,null,null,null,null,null,null,{"$f":"'Input Screen'!$C$8*5280*$AU$4*'Input Screen'!$C$9*2*(T450-$T$6)/12*0.0575","v":{"$error":"#DIV/0!"}},{"$error":"#DIV/0!"},{"$f":"AS450/($AU$4*'Input Screen'!$C$8)","v":{"$error":"#DIV/0!"}},{"$error":"#DIV/0!"},{"$error":"#DIV/0!"},{"$f":"AS450*'Input Screen'!$C$21/1000000","v":{"$error":"#DIV/0!"}}]
[null,null,null,null,null,null,null,null,null,null,null,null,null,null,null,null,null,null,null,{"$error":"#DIV/0!"},{"$f":"'Input Screen'!$C$8*5280*'Input Screen'!$C$9*2*(T451-$T$6)/12*0.0575","v":{"$error":"#DIV/0!"}},{"$f":"U451/'Input Screen'!$C$8","v":{"$error":"#DIV/0!"}},{"$error":"#DIV/0!"},{"$error":"#DIV/0!"},{"$f":"U451*'Input Screen'!$C$21/1000000","v":{"$error":"#DIV/0!"}},44.600000000000364,{"$error":"#VALUE!"},{"$error":"#VALUE!"},null,null,null,null,null,null,null,null,null,null,null,null,null,null,null,null,{"$f":"'Input Screen'!$C$8*5280*$AU$4*'Input Screen'!$C$9*2*(T451-$T$6)/12*0.0575","v":{"$error":"#DIV/0!"}},{"$error":"#DIV/0!"},{"$f":"AS451/($AU$4*'Input Screen'!$C$8)","v":{"$error":"#DIV/0!"}},{"$error":"#DIV/0!"},{"$error":"#DIV/0!"},{"$f":"AS451*'Input Screen'!$C$21/1000000","v":{"$error":"#DIV/0!"}}]
[null,null,null,null,null,null,null,null,null,null,null,null,null,null,null,null,null,null,null,{"$error":"#DIV/0!"},{"$f":"'Input Screen'!$C$8*5280*'Input Screen'!$C$9*2*(T452-$T$6)/12*0.0575","v":{"$error":"#DIV/0!"}},{"$f":"U452/'Input Screen'!$C$8","v":{"$error":"#DIV/0!"}},{"$error":"#DIV/0!"},{"$error":"#DIV/0!"},{"$f":"U452*'Input Screen'!$C$21/1000000","v":{"$error":"#DIV/0!"}},44.700000000000365,{"$error":"#VALUE!"},{"$error":"#VALUE!"},null,null,null,null,null,null,null,null,null,null,null,null,null,null,null,null,{"$f":"'Input Screen'!$C$8*5280*$AU$4*'Input Screen'!$C$9*2*(T452-$T$6)/12*0.0575","v":{"$error":"#DIV/0!"}},{"$error":"#DIV/0!"},{"$f":"AS452/($AU$4*'Input Screen'!$C$8)","v":{"$error":"#DIV/0!"}},{"$error":"#DIV/0!"},{"$error":"#DIV/0!"},{"$f":"AS452*'Input Screen'!$C$21/1000000","v":{"$error":"#DIV/0!"}}]
[null,null,null,null,null,null,null,null,null,null,null,null,null,null,null,null,null,null,null,{"$error":"#DIV/0!"},{"$f":"'Input Screen'!$C$8*5280*'Input Screen'!$C$9*2*(T453-$T$6)/12*0.0575","v":{"$error":"#DIV/0!"}},{"$f":"U453/'Input Screen'!$C$8","v":{"$error":"#DIV/0!"}},{"$error":"#DIV/0!"},{"$error":"#DIV/0!"},{"$f":"U453*'Input Screen'!$C$21/1000000","v":{"$error":"#DIV/0!"}},44.800000000000367,{"$error":"#VALUE!"},{"$error":"#VALUE!"},null,null,null,null,null,null,null,null,null,null,null,null,null,null,null,null,{"$f":"'Input Screen'!$C$8*5280*$AU$4*'Input Screen'!$C$9*2*(T453-$T$6)/12*0.0575","v":{"$error":"#DIV/0!"}},{"$error":"#DIV/0!"},{"$f":"AS453/($AU$4*'Input Screen'!$C$8)","v":{"$error":"#DIV/0!"}},{"$error":"#DIV/0!"},{"$error":"#DIV/0!"},{"$f":"AS453*'Input Screen'!$C$21/1000000","v":{"$error":"#DIV/0!"}}]
[null,null,null,null,null,null,null,null,null,null,null,null,null,null,null,null,null,null,null,{"$error":"#DIV/0!"},{"$f":"'Input Screen'!$C$8*5280*'Input Screen'!$C$9*2*(T454-$T$6)/12*0.0575","v":{"$error":"#DIV/0!"}},{"$f":"U454/'Input Screen'!$C$8","v":{"$error":"#DIV/0!"}},{"$error":"#DIV/0!"},{"$error":"#DIV/0!"},{"$f":"U454*'Input Screen'!$C$21/1000000","v":{"$error":"#DIV/0!"}},44.900000000000368,{"$error":"#VALUE!"},{"$error":"#VALUE!"},null,null,null,null,null,null,null,null,null,null,null,null,null,null,null,null,{"$f":"'Input Screen'!$C$8*5280*$AU$4*'Input Screen'!$C$9*2*(T454-$T$6)/12*0.0575","v":{"$error":"#DIV/0!"}},{"$error":"#DIV/0!"},{"$f":"AS454/($AU$4*'Input Screen'!$C$8)","v":{"$error":"#DIV/0!"}},{"$error":"#DIV/0!"},{"$error":"#DIV/0!"},{"$f":"AS454*'Input Screen'!$C$21/1000000","v":{"$error":"#DIV/0!"}}]
[null,null,null,null,null,null,null,null,null,null,null,null,null,null,null,null,null,null,null,{"$error":"#DIV/0!"},{"$f":"'Input Screen'!$C$8*5280*'Input Screen'!$C$9*2*(T455-$T$6)/12*0.0575","v":{"$error":"#DIV/0!"}},{"$f":"U455/'Input Screen'!$C$8","v":{"$error":"#DIV/0!"}},{"$f":"1-(_xlfn.NORM.S.DIST((T455-$BA$6)/((MAX($T$6:$T$306)-$BA$6)/6),TRUE))","v":{"$error":"#DIV/0!"}},{"$f":"U455*$R$6/1000000","v":{"$error":"#DIV/0!"}},{"$f":"U455*'Input Screen'!$C$21/1000000","v":{"$error":"#DIV/0!"}},45.000000000000369,{"$f":"(_xlfn.WEIBULL.DIST(Z455,$M$6,$M$7,TRUE))","v":{"$error":"#VALUE!"}},{"$f":"1-AA455","v":{"$error":"#VALUE!"}},null,null,null,null,null,null,null,null,null,null,null,null,null,null,null,null,{"$f":"'Input Screen'!$C$8*5280*$AU$4*'Input Screen'!$C$9*2*(T455-$T$6)/12*0.0575","v":{"$error":"#DIV/0!"}},{"$error":"#DIV/0!"},{"$f":"AS455/($AU$4*'Input Screen'!$C$8)","v":{"$error":"#DIV/0!"}},{"$f":"1-(_xlfn.NORM.S.DIST((AT455-$BA$6)/((MAX($T$6:$T$306)-$BA$6)/6),TRUE))","v":{"$error":"#DIV/0!"}},{"$f":"AS455*$R$6/1000000","v":{"$error":"#DIV/0!"}},{"$f":"AS455*'Input Screen'!$C$21/1000000","v":{"$error":"#DIV/0!"}}]
[null,null,null,null,null,null,null,null,null,null,null,null,null,null,null,null,null,null,null,{"$f":"IF(T455>=5,5,T455+0.01)","v":{"$error":"#DIV/0!"}},{"$f":"'Input Screen'!$C$8*5280*'Input Screen'!$C$9*2*(T456-$T$6)/12*0.0575","v":{"$error":"#DIV/0!"}},{"$f":"U456/'Input Screen'!$C$8","v":{"$error":"#DIV/0!"}},{"$error":"#DIV/0!"},{"$error":"#DIV/0!"},{"$f":"U456*'Input Screen'!$C$21/1000000","v":{"$error":"#DIV/0!"}},{"$f":"Z455+0.1","v":45.100000000000371},{"$error":"#VALUE!"},{"$error":"#VALUE!"},null,null,null,null,null,null,null,null,null,null,null,null,null,null,null,null,{"$f":"'Input Screen'!$C$8*5280*$AU$4*'Input Screen'!$C$9*2*(T456-$T$6)/12*0.0575","v":{"$error":"#DIV/0!"}},{"$f":"IF(AT455>=5,5,AT455+0.01)","v":{"$error":"#DIV/0!"}},{"$f":"AS456/($AU$4*'Input Screen'!$C$8)","v":{"$error":"#DIV/0!"}},{"$error":"#DIV/0!"},{"$error":"#DIV/0!"},{"$f":"AS456*'Input Screen'!$C$21/1000000","v":{"$error":"#DIV/0!"}}]
[null,null,null,null,null,null,null,null,null,null,null,null,null,null,null,null,null,null,null,{"$error":"#DIV/0!"},{"$f":"'Input Screen'!$C$8*5280*'Input Screen'!$C$9*2*(T457-$T$6)/12*0.0575","v":{"$error":"#DIV/0!"}},{"$f":"U457/'Input Screen'!$C$8","v":{"$error":"#DIV/0!"}},{"$error":"#DIV/0!"},{"$error":"#DIV/0!"},{"$f":"U457*'Input Screen'!$C$21/1000000","v":{"$error":"#DIV/0!"}},45.200000000000372,{"$error":"#VALUE!"},{"$error":"#VALUE!"},null,null,null,null,null,null,null,null,null,null,null,null,null,null,null,null,{"$f":"'Input Screen'!$C$8*5280*$AU$4*'Input Screen'!$C$9*2*(T457-$T$6)/12*0.0575","v":{"$error":"#DIV/0!"}},{"$error":"#DIV/0!"},{"$f":"AS457/($AU$4*'Input Screen'!$C$8)","v":{"$error":"#DIV/0!"}},{"$error":"#DIV/0!"},{"$error":"#DIV/0!"},{"$f":"AS457*'Input Screen'!$C$21/1000000","v":{"$error":"#DIV/0!"}}]
[null,null,null,null,null,null,null,null,null,null,null,null,null,null,null,null,null,null,null,{"$error":"#DIV/0!"},{"$f":"'Input Screen'!$C$8*5280*'Input Screen'!$C$9*2*(T458-$T$6)/12*0.0575","v":{"$error":"#DIV/0!"}},{"$f":"U458/'Input Screen'!$C$8","v":{"$error":"#DIV/0!"}},{"$error":"#DIV/0!"},{"$error":"#DIV/0!"},{"$f":"U458*'Input Screen'!$C$21/1000000","v":{"$error":"#DIV/0!"}},45.300000000000374,{"$error":"#VALUE!"},{"$error":"#VALUE!"},null,null,null,null,null,null,null,null,null,null,null,null,null,null,null,null,{"$f":"'Input Screen'!$C$8*5280*$AU$4*'Input Screen'!$C$9*2*(T458-$T$6)/12*0.0575","v":{"$error":"#DIV/0!"}},{"$error":"#DIV/0!"},{"$f":"AS458/($AU$4*'Input Screen'!$C$8)","v":{"$error":"#DIV/0!"}},{"$error":"#DIV/0!"},{"$error":"#DIV/0!"},{"$f":"AS458*'Input Screen'!$C$21/1000000","v":{"$error":"#DIV/0!"}}]
[null,null,null,null,null,null,null,null,null,null,null,null,null,null,null,null,null,null,null,{"$error":"#DIV/0!"},{"$f":"'Input Screen'!$C$8*5280*'Input Screen'!$C$9*2*(T459-$T$6)/12*0.0575","v":{"$error":"#DIV/0!"}},{"$f":"U459/'Input Screen'!$C$8","v":{"$error":"#DIV/0!"}},{"$error":"#DIV/0!"},{"$error":"#DIV/0!"},{"$f":"U459*'Input Screen'!$C$21/1000000","v":{"$error":"#DIV/0!"}},45.400000000000375,{"$error":"#VALUE!"},{"$error":"#VALUE!"},null,null,null,null,null,null,null,null,null,null,null,null,null,null,null,null,{"$f":"'Input Screen'!$C$8*5280*$AU$4*'Input Screen'!$C$9*2*(T459-$T$6)/12*0.0575","v":{"$error":"#DIV/0!"}},{"$error":"#DIV/0!"},{"$f":"AS459/($AU$4*'Input Screen'!$C$8)","v":{"$error":"#DIV/0!"}},{"$error":"#DIV/0!"},{"$error":"#DIV/0!"},{"$f":"AS459*'Input Screen'!$C$21/1000000","v":{"$error":"#DIV/0!"}}]
[null,null,null,null,null,null,null,null,null,null,null,null,null,null,null,null,null,null,null,{"$error":"#DIV/0!"},{"$f":"'Input Screen'!$C$8*5280*'Input Screen'!$C$9*2*(T460-$T$6)/12*0.0575","v":{"$error":"#DIV/0!"}},{"$f":"U460/'Input Screen'!$C$8","v":{"$error":"#DIV/0!"}},{"$error":"#DIV/0!"},{"$error":"#DIV/0!"},{"$f":"U460*'Input Screen'!$C$21/1000000","v":{"$error":"#DIV/0!"}},45.500000000000377,{"$error":"#VALUE!"},{"$error":"#VALUE!"},null,null,null,null,null,null,null,null,null,null,null,null,null,null,null,null,{"$f":"'Input Screen'!$C$8*5280*$AU$4*'Input Screen'!$C$9*2*(T460-$T$6)/12*0.0575","v":{"$error":"#DIV/0!"}},{"$error":"#DIV/0!"},{"$f":"AS460/($AU$4*'Input Screen'!$C$8)","v":{"$error":"#DIV/0!"}},{"$error":"#DIV/0!"},{"$error":"#DIV/0!"},{"$f":"AS460*'Input Screen'!$C$21/1000000","v":{"$error":"#DIV/0!"}}]
[null,null,null,null,null,null,null,null,null,null,null,null,null,null,null,null,null,null,null,{"$error":"#DIV/0!"},{"$f":"'Input Screen'!$C$8*5280*'Input Screen'!$C$9*2*(T461-$T$6)/12*0.0575","v":{"$error":"#DIV/0!"}},{"$f":"U461/'Input Screen'!$C$8","v":{"$error":"#DIV/0!"}},{"$error":"#DIV/0!"},{"$error":"#DIV/0!"},{"$f":"U461*'Input Screen'!$C$21/1000000","v":{"$error":"#DIV/0!"}},45.600000000000378,{"$error":"#VALUE!"},{"$error":"#VALUE!"},null,null,null,null,null,null,null,null,null,null,null,null,null,null,null,null,{"$f":"'Input Screen'!$C$8*5280*$AU$4*'Input Screen'!$C$9*2*(T461-$T$6)/12*0.0575","v":{"$error":"#DIV/0!"}},{"$error":"#DIV/0!"},{"$f":"AS461/($AU$4*'Input Screen'!$C$8)","v":{"$error":"#DIV/0!"}},{"$error":"#DIV/0!"},{"$error":"#DIV/0!"},{"$f":"AS461*'Input Screen'!$C$21/1000000","v":{"$error":"#DIV/0!"}}]
[null,null,null,null,null,null,null,null,null,null,null,null,null,null,null,null,null,null,null,{"$error":"#DIV/0!"},{"$f":"'Input Screen'!$C$8*5280*'Input Screen'!$C$9*2*(T462-$T$6)/12*0.0575","v":{"$error":"#DIV/0!"}},{"$f":"U462/'Input Screen'!$C$8","v":{"$error":"#DIV/0!"}},{"$error":"#DIV/0!"},{"$error":"#DIV/0!"},{"$f":"U462*'Input Screen'!$C$21/1000000","v":{"$error":"#DIV/0!"}},45.700000000000379,{"$error":"#VALUE!"},{"$error":"#VALUE!"},null,null,null,null,null,null,null,null,null,null,null,null,null,null,null,null,{"$f":"'Input Screen'!$C$8*5280*$AU$4*'Input Screen'!$C$9*2*(T462-$T$6)/12*0.0575","v":{"$error":"#DIV/0!"}},{"$error":"#DIV/0!"},{"$f":"AS462/($AU$4*'Input Screen'!$C$8)","v":{"$error":"#DIV/0!"}},{"$error":"#DIV/0!"},{"$error":"#DIV/0!"},{"$f":"AS462*'Input Screen'!$C$21/1000000","v":{"$error":"#DIV/0!"}}]
[null,null,null,null,null,null,null,null,null,null,null,null,null,null,null,null,null,null,null,{"$error":"#DIV/0!"},{"$f":"'Input Screen'!$C$8*5280*'Input Screen'!$C$9*2*(T463-$T$6)/12*0.0575","v":{"$error":"#DIV/0!"}},{"$f":"U463/'Input Screen'!$C$8","v":{"$error":"#DIV/0!"}},{"$error":"#DIV/0!"},{"$error":"#DIV/0!"},{"$f":"U463*'Input Screen'!$C$21/1000000","v":{"$error":"#DIV/0!"}},45.800000000000381,{"$error":"#VALUE!"},{"$error":"#VALUE!"},null,null,null,null,null,null,null,null,null,null,null,null,null,null,null,null,{"$f":"'Input Screen'!$C$8*5280*$AU$4*'Input Screen'!$C$9*2*(T463-$T$6)/12*0.0575","v":{"$error":"#DIV/0!"}},{"$error":"#DIV/0!"},{"$f":"AS463/($AU$4*'Input Screen'!$C$8)","v":{"$error":"#DIV/0!"}},{"$error":"#DIV/0!"},{"$error":"#DIV/0!"},{"$f":"AS463*'Input Screen'!$C$21/1000000","v":{"$error":"#DIV/0!"}}]
[null,null,null,null,null,null,null,null,null,null,null,null,null,null,null,null,null,null,null,{"$error":"#DIV/0!"},{"$f":"'Input Screen'!$C$8*5280*'Input Screen'!$C$9*2*(T464-$T$6)/12*0.0575","v":{"$error":"#DIV/0!"}},{"$f":"U464/'Input Screen'!$C$8","v":{"$error":"#DIV/0!"}},{"$error":"#DIV/0!"},{"$error":"#DIV/0!"},{"$f":"U464*'Input Screen'!$C$21/1000000","v":{"$error":"#DIV/0!"}},45.900000000000382,{"$error":"#VALUE!"},{"$error":"#VALUE!"},null,null,null,null,null,null,null,null,null,null,null,null,null,null,null,null,{"$f":"'Input Screen'!$C$8*5280*$AU$4*'Input Screen'!$C$9*2*(T464-$T$6)/12*0.0575","v":{"$error":"#DIV/0!"}},{"$error":"#DIV/0!"},{"$f":"AS464/($AU$4*'Input Screen'!$C$8)","v":{"$error":"#DIV/0!"}},{"$error":"#DIV/0!"},{"$error":"#DIV/0!"},{"$f":"AS464*'Input Screen'!$C$21/1000000","v":{"$error":"#DIV/0!"}}]
[null,null,null,null,null,null,null,null,null,null,null,null,null,null,null,null,null,null,null,{"$error":"#DIV/0!"},{"$f":"'Input Screen'!$C$8*5280*'Input Screen'!$C$9*2*(T465-$T$6)/12*0.0575","v":{"$error":"#DIV/0!"}},{"$f":"U465/'Input Screen'!$C$8","v":{"$error":"#DIV/0!"}},{"$error":"#DIV/0!"},{"$error":"#DIV/0!"},{"$f":"U465*'Input Screen'!$C$21/1000000","v":{"$error":"#DIV/0!"}},46.000000000000384,{"$error":"#VALUE!"},{"$error":"#VALUE!"},null,null,null,null,null,null,null,null,null,null,null,null,null,null,null,null,{"$f":"'Input Screen'!$C$8*5280*$AU$4*'Input Screen'!$C$9*2*(T465-$T$6)/12*0.0575","v":{"$error":"#DIV/0!"}},{"$error":"#DIV/0!"},{"$f":"AS465/($AU$4*'Input Screen'!$C$8)","v":{"$error":"#DIV/0!"}},{"$error":"#DIV/0!"},{"$error":"#DIV/0!"},{"$f":"AS465*'Input Screen'!$C$21/1000000","v":{"$error":"#DIV/0!"}}]
[null,null,null,null,null,null,null,null,null,null,null,null,null,null,null,null,null,null,null,{"$error":"#DIV/0!"},{"$f":"'Input Screen'!$C$8*5280*'Input Screen'!$C$9*2*(T466-$T$6)/12*0.0575","v":{"$error":"#DIV/0!"}},{"$f":"U466/'Input Screen'!$C$8","v":{"$error":"#DIV/0!"}},{"$error":"#DIV/0!"},{"$error":"#DIV/0!"},{"$f":"U466*'Input Screen'!$C$21/1000000","v":{"$error":"#DIV/0!"}},46.100000000000385,{"$error":"#VALUE!"},{"$error":"#VALUE!"},null,null,null,null,null,null,null,null,null,null,null,null,null,null,null,null,{"$f":"'Input Screen'!$C$8*5280*$AU$4*'Input Screen'!$C$9*2*(T466-$T$6)/12*0.0575","v":{"$error":"#DIV/0!"}},{"$error":"#DIV/0!"},{"$f":"AS466/($AU$4*'Input Screen'!$C$8)","v":{"$error":"#DIV/0!"}},{"$error":"#DIV/0!"},{"$error":"#DIV/0!"},{"$f":"AS466*'Input Screen'!$C$21/1000000","v":{"$error":"#DIV/0!"}}]
[null,null,null,null,null,null,null,null,null,null,null,null,null,null,null,null,null,null,null,{"$error":"#DIV/0!"},{"$f":"'Input Screen'!$C$8*5280*'Input Screen'!$C$9*2*(T467-$T$6)/12*0.0575","v":{"$error":"#DIV/0!"}},{"$f":"U467/'Input Screen'!$C$8","v":{"$error":"#DIV/0!"}},{"$error":"#DIV/0!"},{"$error":"#DIV/0!"},{"$f":"U467*'Input Screen'!$C$21/1000000","v":{"$error":"#DIV/0!"}},46.200000000000387,{"$error":"#VALUE!"},{"$error":"#VALUE!"},null,null,null,null,null,null,null,null,null,null,null,null,null,null,null,null,{"$f":"'Input Screen'!$C$8*5280*$AU$4*'Input Screen'!$C$9*2*(T467-$T$6)/12*0.0575","v":{"$error":"#DIV/0!"}},{"$error":"#DIV/0!"},{"$f":"AS467/($AU$4*'Input Screen'!$C$8)","v":{"$error":"#DIV/0!"}},{"$error":"#DIV/0!"},{"$error":"#DIV/0!"},{"$f":"AS467*'Input Screen'!$C$21/1000000","v":{"$error":"#DIV/0!"}}]
[null,null,null,null,null,null,null,null,null,null,null,null,null,null,null,null,null,null,null,{"$error":"#DIV/0!"},{"$f":"'Input Screen'!$C$8*5280*'Input Screen'!$C$9*2*(T468-$T$6)/12*0.0575","v":{"$error":"#DIV/0!"}},{"$f":"U468/'Input Screen'!$C$8","v":{"$error":"#DIV/0!"}},{"$error":"#DIV/0!"},{"$error":"#DIV/0!"},{"$f":"U468*'Input Screen'!$C$21/1000000","v":{"$error":"#DIV/0!"}},46.300000000000388,{"$error":"#VALUE!"},{"$error":"#VALUE!"},null,null,null,null,null,null,null,null,null,null,null,null,null,null,null,null,{"$f":"'Input Screen'!$C$8*5280*$AU$4*'Input Screen'!$C$9*2*(T468-$T$6)/12*0.0575","v":{"$error":"#DIV/0!"}},{"$error":"#DIV/0!"},{"$f":"AS468/($AU$4*'Input Screen'!$C$8)","v":{"$error":"#DIV/0!"}},{"$error":"#DIV/0!"},{"$error":"#DIV/0!"},{"$f":"AS468*'Input Screen'!$C$21/1000000","v":{"$error":"#DIV/0!"}}]
[null,null,null,null,null,null,null,null,null,null,null,null,null,null,null,null,null,null,null,{"$error":"#DIV/0!"},{"$f":"'Input Screen'!$C$8*5280*'Input Screen'!$C$9*2*(T469-$T$6)/12*0.0575","v":{"$error":"#DIV/0!"}},{"$f":"U469/'Input Screen'!$C$8","v":{"$error":"#DIV/0!"}},{"$error":"#DIV/0!"},{"$error":"#DIV/0!"},{"$f":"U469*'Input Screen'!$C$21/1000000","v":{"$error":"#DIV/0!"}},46.400000000000389,{"$error":"#VALUE!"},{"$error":"#VALUE!"},null,null,null,null,null,null,null,null,null,null,null,null,null,null,null,null,{"$f":"'Input Screen'!$C$8*5280*$AU$4*'Input Screen'!$C$9*2*(T469-$T$6)/12*0.0575","v":{"$error":"#DIV/0!"}},{"$error":"#DIV/0!"},{"$f":"AS469/($AU$4*'Input Screen'!$C$8)","v":{"$error":"#DIV/0!"}},{"$error":"#DIV/0!"},{"$error":"#DIV/0!"},{"$f":"AS469*'Input Screen'!$C$21/1000000","v":{"$error":"#DIV/0!"}}]
[null,null,null,null,null,null,null,null,null,null,null,null,null,null,null,null,null,null,null,{"$error":"#DIV/0!"},{"$f":"'Input Screen'!$C$8*5280*'Input Screen'!$C$9*2*(T470-$T$6)/12*0.0575","v":{"$error":"#DIV/0!"}},{"$f":"U470/'Input Screen'!$C$8","v":{"$error":"#DIV/0!"}},{"$error":"#DIV/0!"},{"$error":"#DIV/0!"},{"$f":"U470*'Input Screen'!$C$21/1000000","v":{"$error":"#DIV/0!"}},46.500000000000391,{"$error":"#VALUE!"},{"$error":"#VALUE!"},null,null,null,null,null,null,null,null,null,null,null,null,null,null,null,null,{"$f":"'Input Screen'!$C$8*5280*$AU$4*'Input Screen'!$C$9*2*(T470-$T$6)/12*0.0575","v":{"$error":"#DIV/0!"}},{"$error":"#DIV/0!"},{"$f":"AS470/($AU$4*'Input Screen'!$C$8)","v":{"$error":"#DIV/0!"}},{"$error":"#DIV/0!"},{"$error":"#DIV/0!"},{"$f":"AS470*'Input Screen'!$C$21/1000000","v":{"$error":"#DIV/0!"}}]
[null,null,null,null,null,null,null,null,null,null,null,null,null,null,null,null,null,null,null,{"$error":"#DIV/0!"},{"$f":"'Input Screen'!$C$8*5280*'Input Screen'!$C$9*2*(T471-$T$6)/12*0.0575","v":{"$error":"#DIV/0!"}},{"$f":"U471/'Input Screen'!$C$8","v":{"$error":"#DIV/0!"}},{"$error":"#DIV/0!"},{"$error":"#DIV/0!"},{"$f":"U471*'Input Screen'!$C$21/1000000","v":{"$error":"#DIV/0!"}},46.600000000000392,{"$error":"#VALUE!"},{"$error":"#VALUE!"},null,null,null,null,null,null,null,null,null,null,null,null,null,null,null,null,{"$f":"'Input Screen'!$C$8*5280*$AU$4*'Input Screen'!$C$9*2*(T471-$T$6)/12*0.0575","v":{"$error":"#DIV/0!"}},{"$error":"#DIV/0!"},{"$f":"AS471/($AU$4*'Input Screen'!$C$8)","v":{"$error":"#DIV/0!"}},{"$error":"#DIV/0!"},{"$error":"#DIV/0!"},{"$f":"AS471*'Input Screen'!$C$21/1000000","v":{"$error":"#DIV/0!"}}]
[null,null,null,null,null,null,null,null,null,null,null,null,null,null,null,null,null,null,null,{"$error":"#DIV/0!"},{"$f":"'Input Screen'!$C$8*5280*'Input Screen'!$C$9*2*(T472-$T$6)/12*0.0575","v":{"$error":"#DIV/0!"}},{"$f":"U472/'Input Screen'!$C$8","v":{"$error":"#DIV/0!"}},{"$error":"#DIV/0!"},{"$error":"#DIV/0!"},{"$f":"U472*'Input Screen'!$C$21/1000000","v":{"$error":"#DIV/0!"}},46.700000000000394,{"$error":"#VALUE!"},{"$error":"#VALUE!"},null,null,null,null,null,null,null,null,null,null,null,null,null,null,null,null,{"$f":"'Input Screen'!$C$8*5280*$AU$4*'Input Screen'!$C$9*2*(T472-$T$6)/12*0.0575","v":{"$error":"#DIV/0!"}},{"$error":"#DIV/0!"},{"$f":"AS472/($AU$4*'Input Screen'!$C$8)","v":{"$error":"#DIV/0!"}},{"$error":"#DIV/0!"},{"$error":"#DIV/0!"},{"$f":"AS472*'Input Screen'!$C$21/1000000","v":{"$error":"#DIV/0!"}}]
[null,null,null,null,null,null,null,null,null,null,null,null,null,null,null,null,null,null,null,{"$error":"#DIV/0!"},{"$f":"'Input Screen'!$C$8*5280*'Input Screen'!$C$9*2*(T473-$T$6)/12*0.0575","v":{"$error":"#DIV/0!"}},{"$f":"U473/'Input Screen'!$C$8","v":{"$error":"#DIV/0!"}},{"$error":"#DIV/0!"},{"$error":"#DIV/0!"},{"$f":"U473*'Input Screen'!$C$21/1000000","v":{"$error":"#DIV/0!"}},46.800000000000395,{"$error":"#VALUE!"},{"$error":"#VALUE!"},null,null,null,null,null,null,null,null,null,null,null,null,null,null,null,null,{"$f":"'Input Screen'!$C$8*5280*$AU$4*'Input Screen'!$C$9*2*(T473-$T$6)/12*0.0575","v":{"$error":"#DIV/0!"}},{"$error":"#DIV/0!"},{"$f":"AS473/($AU$4*'Input Screen'!$C$8)","v":{"$error":"#DIV/0!"}},{"$error":"#DIV/0!"},{"$error":"#DIV/0!"},{"$f":"AS473*'Input Screen'!$C$21/1000000","v":{"$error":"#DIV/0!"}}]
[null,null,null,null,null,null,null,null,null,null,null,null,null,null,null,null,null,null,null,{"$error":"#DIV/0!"},{"$f":"'Input Screen'!$C$8*5280*'Input Screen'!$C$9*2*(T474-$T$6)/12*0.0575","v":{"$error":"#DIV/0!"}},{"$f":"U474/'Input Screen'!$C$8","v":{"$error":"#DIV/0!"}},{"$error":"#DIV/0!"},{"$error":"#DIV/0!"},{"$f":"U474*'Input Screen'!$C$21/1000000","v":{"$error":"#DIV/0!"}},46.900000000000396,{"$error":"#VALUE!"},{"$error":"#VALUE!"},null,null,null,null,null,null,null,null,null,null,null,null,null,null,null,null,{"$f":"'Input Screen'!$C$8*5280*$AU$4*'Input Screen'!$C$9*2*(T474-$T$6)/12*0.0575","v":{"$error":"#DIV/0!"}},{"$error":"#DIV/0!"},{"$f":"AS474/($AU$4*'Input Screen'!$C$8)","v":{"$error":"#DIV/0!"}},{"$error":"#DIV/0!"},{"$error":"#DIV/0!"},{"$f":"AS474*'Input Screen'!$C$21/1000000","v":{"$error":"#DIV/0!"}}]
[null,null,null,null,null,null,null,null,null,null,null,null,null,null,null,null,null,null,null,{"$error":"#DIV/0!"},{"$f":"'Input Screen'!$C$8*5280*'Input Screen'!$C$9*2*(T475-$T$6)/12*0.0575","v":{"$error":"#DIV/0!"}},{"$f":"U475/'Input Screen'!$C$8","v":{"$error":"#DIV/0!"}},{"$error":"#DIV/0!"},{"$error":"#DIV/0!"},{"$f":"U475*'Input Screen'!$C$21/1000000","v":{"$error":"#DIV/0!"}},47.000000000000398,{"$error":"#VALUE!"},{"$error":"#VALUE!"},null,null,null,null,null,null,null,null,null,null,null,null,null,null,null,null,{"$f":"'Input Screen'!$C$8*5280*$AU$4*'Input Screen'!$C$9*2*(T475-$T$6)/12*0.0575","v":{"$error":"#DIV/0!"}},{"$error":"#DIV/0!"},{"$f":"AS475/($AU$4*'Input Screen'!$C$8)","v":{"$error":"#DIV/0!"}},{"$error":"#DIV/0!"},{"$error":"#DIV/0!"},{"$f":"AS475*'Input Screen'!$C$21/1000000","v":{"$error":"#DIV/0!"}}]
[null,null,null,null,null,null,null,null,null,null,null,null,null,null,null,null,null,null,null,{"$error":"#DIV/0!"},{"$f":"'Input Screen'!$C$8*5280*'Input Screen'!$C$9*2*(T476-$T$6)/12*0.0575","v":{"$error":"#DIV/0!"}},{"$f":"U476/'Input Screen'!$C$8","v":{"$error":"#DIV/0!"}},{"$error":"#DIV/0!"},{"$error":"#DIV/0!"},{"$f":"U476*'Input Screen'!$C$21/1000000","v":{"$error":"#DIV/0!"}},47.100000000000399,{"$error":"#VALUE!"},{"$error":"#VALUE!"},null,null,null,null,null,null,null,null,null,null,null,null,null,null,null,null,{"$f":"'Input Screen'!$C$8*5280*$AU$4*'Input Screen'!$C$9*2*(T476-$T$6)/12*0.0575","v":{"$error":"#DIV/0!"}},{"$error":"#DIV/0!"},{"$f":"AS476/($AU$4*'Input Screen'!$C$8)","v":{"$error":"#DIV/0!"}},{"$error":"#DIV/0!"},{"$error":"#DIV/0!"},{"$f":"AS476*'Input Screen'!$C$21/1000000","v":{"$error":"#DIV/0!"}}]
[null,null,null,null,null,null,null,null,null,null,null,null,null,null,null,null,null,null,null,{"$error":"#DIV/0!"},{"$f":"'Input Screen'!$C$8*5280*'Input Screen'!$C$9*2*(T477-$T$6)/12*0.0575","v":{"$error":"#DIV/0!"}},{"$f":"U477/'Input Screen'!$C$8","v":{"$error":"#DIV/0!"}},{"$error":"#DIV/0!"},{"$error":"#DIV/0!"},{"$f":"U477*'Input Screen'!$C$21/1000000","v":{"$error":"#DIV/0!"}},47.200000000000401,{"$error":"#VALUE!"},{"$error":"#VALUE!"},null,null,null,null,null,null,null,null,null,null,null,null,null,null,null,null,{"$f":"'Input Screen'!$C$8*5280*$AU$4*'Input Screen'!$C$9*2*(T477-$T$6)/12*0.0575","v":{"$error":"#DIV/0!"}},{"$error":"#DIV/0!"},{"$f":"AS477/($AU$4*'Input Screen'!$C$8)","v":{"$error":"#DIV/0!"}},{"$error":"#DIV/0!"},{"$error":"#DIV/0!"},{"$f":"AS477*'Input Screen'!$C$21/1000000","v":{"$error":"#DIV/0!"}}]
[null,null,null,null,null,null,null,null,null,null,null,null,null,null,null,null,null,null,null,{"$error":"#DIV/0!"},{"$f":"'Input Screen'!$C$8*5280*'Input Screen'!$C$9*2*(T478-$T$6)/12*0.0575","v":{"$error":"#DIV/0!"}},{"$f":"U478/'Input Screen'!$C$8","v":{"$error":"#DIV/0!"}},{"$error":"#DIV/0!"},{"$error":"#DIV/0!"},{"$f":"U478*'Input Screen'!$C$21/1000000","v":{"$error":"#DIV/0!"}},47.300000000000402,{"$error":"#VALUE!"},{"$error":"#VALUE!"},null,null,null,null,null,null,null,null,null,null,null,null,null,null,null,null,{"$f":"'Input Screen'!$C$8*5280*$AU$4*'Input Screen'!$C$9*2*(T478-$T$6)/12*0.0575","v":{"$error":"#DIV/0!"}},{"$error":"#DIV/0!"},{"$f":"AS478/($AU$4*'Input Screen'!$C$8)","v":{"$error":"#DIV/0!"}},{"$error":"#DIV/0!"},{"$error":"#DIV/0!"},{"$f":"AS478*'Input Screen'!$C$21/1000000","v":{"$error":"#DIV/0!"}}]
[null,null,null,null,null,null,null,null,null,null,null,null,null,null,null,null,null,null,null,{"$error":"#DIV/0!"},{"$f":"'Input Screen'!$C$8*5280*'Input Screen'!$C$9*2*(T479-$T$6)/12*0.0575","v":{"$error":"#DIV/0!"}},{"$f":"U479/'Input Screen'!$C$8","v":{"$error":"#DIV/0!"}},{"$error":"#DIV/0!"},{"$error":"#DIV/0!"},{"$f":"U479*'Input Screen'!$C$21/1000000","v":{"$error":"#DIV/0!"}},47.400000000000404,{"$error":"#VALUE!"},{"$error":"#VALUE!"},null,null,null,null,null,null,null,null,null,null,null,null,null,null,null,null,{"$f":"'Input Screen'!$C$8*5280*$AU$4*'Input Screen'!$C$9*2*(T479-$T$6)/12*0.0575","v":{"$error":"#DIV/0!"}},{"$error":"#DIV/0!"},{"$f":"AS479/($AU$4*'Input Screen'!$C$8)","v":{"$error":"#DIV/0!"}},{"$error":"#DIV/0!"},{"$error":"#DIV/0!"},{"$f":"AS479*'Input Screen'!$C$21/1000000","v":{"$error":"#DIV/0!"}}]
[null,null,null,null,null,null,null,null,null,null,null,null,null,null,null,null,null,null,null,{"$error":"#DIV/0!"},{"$f":"'Input Screen'!$C$8*5280*'Input Screen'!$C$9*2*(T480-$T$6)/12*0.0575","v":{"$error":"#DIV/0!"}},{"$f":"U480/'Input Screen'!$C$8","v":{"$error":"#DIV/0!"}},{"$error":"#DIV/0!"},{"$error":"#DIV/0!"},{"$f":"U480*'Input Screen'!$C$21/1000000","v":{"$error":"#DIV/0!"}},47.500000000000405,{"$error":"#VALUE!"},{"$error":"#VALUE!"},null,null,null,null,null,null,null,null,null,null,null,null,null,null,null,null,{"$f":"'Input Screen'!$C$8*5280*$AU$4*'Input Screen'!$C$9*2*(T480-$T$6)/12*0.0575","v":{"$error":"#DIV/0!"}},{"$error":"#DIV/0!"},{"$f":"AS480/($AU$4*'Input Screen'!$C$8)","v":{"$error":"#DIV/0!"}},{"$error":"#DIV/0!"},{"$error":"#DIV/0!"},{"$f":"AS480*'Input Screen'!$C$21/1000000","v":{"$error":"#DIV/0!"}}]
[null,null,null,null,null,null,null,null,null,null,null,null,null,null,null,null,null,null,null,{"$error":"#DIV/0!"},{"$f":"'Input Screen'!$C$8*5280*'Input Screen'!$C$9*2*(T481-$T$6)/12*0.0575","v":{"$error":"#DIV/0!"}},{"$f":"U481/'Input Screen'!$C$8","v":{"$error":"#DIV/0!"}},{"$error":"#DIV/0!"},{"$error":"#DIV/0!"},{"$f":"U481*'Input Screen'!$C$21/1000000","v":{"$error":"#DIV/0!"}},47.600000000000406,{"$error":"#VALUE!"},{"$error":"#VALUE!"},null,null,null,null,null,null,null,null,null,null,null,null,null,null,null,null,{"$f":"'Input Screen'!$C$8*5280*$AU$4*'Input Screen'!$C$9*2*(T481-$T$6)/12*0.0575","v":{"$error":"#DIV/0!"}},{"$error":"#DIV/0!"},{"$f":"AS481/($AU$4*'Input Screen'!$C$8)","v":{"$error":"#DIV/0!"}},{"$error":"#DIV/0!"},{"$error":"#DIV/0!"},{"$f":"AS481*'Input Screen'!$C$21/1000000","v":{"$error":"#DIV/0!"}}]
[null,null,null,null,null,null,null,null,null,null,null,null,null,null,null,null,null,null,null,{"$error":"#DIV/0!"},{"$f":"'Input Screen'!$C$8*5280*'Input Screen'!$C$9*2*(T482-$T$6)/12*0.0575","v":{"$error":"#DIV/0!"}},{"$f":"U482/'Input Screen'!$C$8","v":{"$error":"#DIV/0!"}},{"$error":"#DIV/0!"},{"$error":"#DIV/0!"},{"$f":"U482*'Input Screen'!$C$21/1000000","v":{"$error":"#DIV/0!"}},47.700000000000408,{"$error":"#VALUE!"},{"$error":"#VALUE!"},null,null,null,null,null,null,null,null,null,null,null,null,null,null,null,null,{"$f":"'Input Screen'!$C$8*5280*$AU$4*'Input Screen'!$C$9*2*(T482-$T$6)/12*0.0575","v":{"$error":"#DIV/0!"}},{"$error":"#DIV/0!"},{"$f":"AS482/($AU$4*'Input Screen'!$C$8)","v":{"$error":"#DIV/0!"}},{"$error":"#DIV/0!"},{"$error":"#DIV/0!"},{"$f":"AS482*'Input Screen'!$C$21/1000000","v":{"$error":"#DIV/0!"}}]
[null,null,null,null,null,null,null,null,null,null,null,null,null,null,null,null,null,null,null,{"$error":"#DIV/0!"},{"$f":"'Input Screen'!$C$8*5280*'Input Screen'!$C$9*2*(T483-$T$6)/12*0.0575","v":{"$error":"#DIV/0!"}},{"$f":"U483/'Input Screen'!$C$8","v":{"$error":"#DIV/0!"}},{"$error":"#DIV/0!"},{"$error":"#DIV/0!"},{"$f":"U483*'Input Screen'!$C$21/1000000","v":{"$error":"#DIV/0!"}},47.800000000000409,{"$error":"#VALUE!"},{"$error":"#VALUE!"},null,null,null,null,null,null,null,null,null,null,null,null,null,null,null,null,{"$f":"'Input Screen'!$C$8*5280*$AU$4*'Input Screen'!$C$9*2*(T483-$T$6)/12*0.0575","v":{"$error":"#DIV/0!"}},{"$error":"#DIV/0!"},{"$f":"AS483/($AU$4*'Input Screen'!$C$8)","v":{"$error":"#DIV/0!"}},{"$error":"#DIV/0!"},{"$error":"#DIV/0!"},{"$f":"AS483*'Input Screen'!$C$21/1000000","v":{"$error":"#DIV/0!"}}]
[null,null,null,null,null,null,null,null,null,null,null,null,null,null,null,null,null,null,null,{"$error":"#DIV/0!"},{"$f":"'Input Screen'!$C$8*5280*'Input Screen'!$C$9*2*(T484-$T$6)/12*0.0575","v":{"$error":"#DIV/0!"}},{"$f":"U484/'Input Screen'!$C$8","v":{"$error":"#DIV/0!"}},{"$error":"#DIV/0!"},{"$error":"#DIV/0!"},{"$f":"U484*'Input Screen'!$C$21/1000000","v":{"$error":"#DIV/0!"}},47.900000000000411,{"$error":"#VALUE!"},{"$error":"#VALUE!"},null,null,null,null,null,null,null,null,null,null,null,null,null,null,null,null,{"$f":"'Input Screen'!$C$8*5280*$AU$4*'Input Screen'!$C$9*2*(T484-$T$6)/12*0.0575","v":{"$error":"#DIV/0!"}},{"$error":"#DIV/0!"},{"$f":"AS484/($AU$4*'Input Screen'!$C$8)","v":{"$error":"#DIV/0!"}},{"$error":"#DIV/0!"},{"$error":"#DIV/0!"},{"$f":"AS484*'Input Screen'!$C$21/1000000","v":{"$error":"#DIV/0!"}}]
[null,null,null,null,null,null,null,null,null,null,null,null,null,null,null,null,null,null,null,{"$error":"#DIV/0!"},{"$f":"'Input Screen'!$C$8*5280*'Input Screen'!$C$9*2*(T485-$T$6)/12*0.0575","v":{"$error":"#DIV/0!"}},{"$f":"U485/'Input Screen'!$C$8","v":{"$error":"#DIV/0!"}},{"$error":"#DIV/0!"},{"$error":"#DIV/0!"},{"$f":"U485*'Input Screen'!$C$21/1000000","v":{"$error":"#DIV/0!"}},48.000000000000412,{"$error":"#VALUE!"},{"$error":"#VALUE!"},null,null,null,null,null,null,null,null,null,null,null,null,null,null,null,null,{"$f":"'Input Screen'!$C$8*5280*$AU$4*'Input Screen'!$C$9*2*(T485-$T$6)/12*0.0575","v":{"$error":"#DIV/0!"}},{"$error":"#DIV/0!"},{"$f":"AS485/($AU$4*'Input Screen'!$C$8)","v":{"$error":"#DIV/0!"}},{"$error":"#DIV/0!"},{"$error":"#DIV/0!"},{"$f":"AS485*'Input Screen'!$C$21/1000000","v":{"$error":"#DIV/0!"}}]
[null,null,null,null,null,null,null,null,null,null,null,null,null,null,null,null,null,null,null,{"$error":"#DIV/0!"},{"$f":"'Input Screen'!$C$8*5280*'Input Screen'!$C$9*2*(T486-$T$6)/12*0.0575","v":{"$error":"#DIV/0!"}},{"$f":"U486/'Input Screen'!$C$8","v":{"$error":"#DIV/0!"}},{"$error":"#DIV/0!"},{"$error":"#DIV/0!"},{"$f":"U486*'Input Screen'!$C$21/1000000","v":{"$error":"#DIV/0!"}},null,null,null,null,null,null,null,null,null,null,null,null,null,null,null,null,null,null,null,{"$f":"'Input Screen'!$C$8*5280*$AU$4*'Input Screen'!$C$9*2*(T486-$T$6)/12*0.0575","v":{"$error":"#DIV/0!"}},{"$error":"#DIV/0!"},{"$f":"AS486/($AU$4*'Input Screen'!$C$8)","v":{"$error":"#DIV/0!"}},{"$error":"#DIV/0!"},{"$error":"#DIV/0!"},{"$f":"AS486*'Input Screen'!$C$21/1000000","v":{"$error":"#DIV/0!"}}]
[null,null,null,null,null,null,null,null,null,null,null,null,null,null,null,null,null,null,null,{"$error":"#DIV/0!"},{"$f":"'Input Screen'!$C$8*5280*'Input Screen'!$C$9*2*(T487-$T$6)/12*0.0575","v":{"$error":"#DIV/0!"}},{"$f":"U487/'Input Screen'!$C$8","v":{"$error":"#DIV/0!"}},{"$error":"#DIV/0!"},{"$error":"#DIV/0!"},{"$f":"U487*'Input Screen'!$C$21/1000000","v":{"$error":"#DIV/0!"}},null,null,null,null,null,null,null,null,null,null,null,null,null,null,null,null,null,null,null,{"$f":"'Input Screen'!$C$8*5280*$AU$4*'Input Screen'!$C$9*2*(T487-$T$6)/12*0.0575","v":{"$error":"#DIV/0!"}},{"$error":"#DIV/0!"},{"$f":"AS487/($AU$4*'Input Screen'!$C$8)","v":{"$error":"#DIV/0!"}},{"$error":"#DIV/0!"},{"$error":"#DIV/0!"},{"$f":"AS487*'Input Screen'!$C$21/1000000","v":{"$error":"#DIV/0!"}}]
[null,null,null,null,null,null,null,null,null,null,null,null,null,null,null,null,null,null,null,{"$error":"#DIV/0!"},{"$f":"'Input Screen'!$C$8*5280*'Input Screen'!$C$9*2*(T488-$T$6)/12*0.0575","v":{"$error":"#DIV/0!"}},{"$f":"U488/'Input Screen'!$C$8","v":{"$error":"#DIV/0!"}},{"$error":"#DIV/0!"},{"$error":"#DIV/0!"},{"$f":"U488*'Input Screen'!$C$21/1000000","v":{"$error":"#DIV/0!"}},null,null,null,null,null,null,null,null,null,null,null,null,null,null,null,null,null,null,null,{"$f":"'Input Screen'!$C$8*5280*$AU$4*'Input Screen'!$C$9*2*(T488-$T$6)/12*0.0575","v":{"$error":"#DIV/0!"}},{"$error":"#DIV/0!"},{"$f":"AS488/($AU$4*'Input Screen'!$C$8)","v":{"$error":"#DIV/0!"}},{"$error":"#DIV/0!"},{"$error":"#DIV/0!"},{"$f":"AS488*'Input Screen'!$C$21/1000000","v":{"$error":"#DIV/0!"}}]
[null,null,null,null,null,null,null,null,null,null,null,null,null,null,null,null,null,null,null,{"$error":"#DIV/0!"},{"$f":"'Input Screen'!$C$8*5280*'Input Screen'!$C$9*2*(T489-$T$6)/12*0.0575","v":{"$error":"#DIV/0!"}},{"$f":"U489/'Input Screen'!$C$8","v":{"$error":"#DIV/0!"}},{"$error":"#DIV/0!"},{"$error":"#DIV/0!"},{"$f":"U489*'Input Screen'!$C$21/1000000","v":{"$error":"#DIV/0!"}},null,null,null,null,null,null,null,null,null,null,null,null,null,null,null,null,null,null,null,{"$f":"'Input Screen'!$C$8*5280*$AU$4*'Input Screen'!$C$9*2*(T489-$T$6)/12*0.0575","v":{"$error":"#DIV/0!"}},{"$error":"#DIV/0!"},{"$f":"AS489/($AU$4*'Input Screen'!$C$8)","v":{"$error":"#DIV/0!"}},{"$error":"#DIV/0!"},{"$error":"#DIV/0!"},{"$f":"AS489*'Input Screen'!$C$21/1000000","v":{"$error":"#DIV/0!"}}]
[null,null,null,null,null,null,null,null,null,null,null,null,null,null,null,null,null,null,null,{"$error":"#DIV/0!"},{"$f":"'Input Screen'!$C$8*5280*'Input Screen'!$C$9*2*(T490-$T$6)/12*0.0575","v":{"$error":"#DIV/0!"}},{"$f":"U490/'Input Screen'!$C$8","v":{"$error":"#DIV/0!"}},{"$error":"#DIV/0!"},{"$error":"#DIV/0!"},{"$f":"U490*'Input Screen'!$C$21/1000000","v":{"$error":"#DIV/0!"}},null,null,null,null,null,null,null,null,null,null,null,null,null,null,null,null,null,null,null,{"$f":"'Input Screen'!$C$8*5280*$AU$4*'Input Screen'!$C$9*2*(T490-$T$6)/12*0.0575","v":{"$error":"#DIV/0!"}},{"$error":"#DIV/0!"},{"$f":"AS490/($AU$4*'Input Screen'!$C$8)","v":{"$error":"#DIV/0!"}},{"$error":"#DIV/0!"},{"$error":"#DIV/0!"},{"$f":"AS490*'Input Screen'!$C$21/1000000","v":{"$error":"#DIV/0!"}}]
[null,null,null,null,null,null,null,null,null,null,null,null,null,null,null,null,null,null,null,{"$error":"#DIV/0!"},{"$f":"'Input Screen'!$C$8*5280*'Input Screen'!$C$9*2*(T491-$T$6)/12*0.0575","v":{"$error":"#DIV/0!"}},{"$f":"U491/'Input Screen'!$C$8","v":{"$error":"#DIV/0!"}},{"$error":"#DIV/0!"},{"$error":"#DIV/0!"},{"$f":"U491*'Input Screen'!$C$21/1000000","v":{"$error":"#DIV/0!"}},null,null,null,null,null,null,null,null,null,null,null,null,null,null,null,null,null,null,null,{"$f":"'Input Screen'!$C$8*5280*$AU$4*'Input Screen'!$C$9*2*(T491-$T$6)/12*0.0575","v":{"$error":"#DIV/0!"}},{"$error":"#DIV/0!"},{"$f":"AS491/($AU$4*'Input Screen'!$C$8)","v":{"$error":"#DIV/0!"}},{"$error":"#DIV/0!"},{"$error":"#DIV/0!"},{"$f":"AS491*'Input Screen'!$C$21/1000000","v":{"$error":"#DIV/0!"}}]
[null,null,null,null,null,null,null,null,null,null,null,null,null,null,null,null,null,null,null,{"$error":"#DIV/0!"},{"$f":"'Input Screen'!$C$8*5280*'Input Screen'!$C$9*2*(T492-$T$6)/12*0.0575","v":{"$error":"#DIV/0!"}},{"$f":"U492/'Input Screen'!$C$8","v":{"$error":"#DIV/0!"}},{"$error":"#DIV/0!"},{"$error":"#DIV/0!"},{"$f":"U492*'Input Screen'!$C$21/1000000","v":{"$error":"#DIV/0!"}},null,null,null,null,null,null,null,null,null,null,null,null,null,null,null,null,null,null,null,{"$f":"'Input Screen'!$C$8*5280*$AU$4*'Input Screen'!$C$9*2*(T492-$T$6)/12*0.0575","v":{"$error":"#DIV/0!"}},{"$error":"#DIV/0!"},{"$f":"AS492/($AU$4*'Input Screen'!$C$8)","v":{"$error":"#DIV/0!"}},{"$error":"#DIV/0!"},{"$error":"#DIV/0!"},{"$f":"AS492*'Input Screen'!$C$21/1000000","v":{"$error":"#DIV/0!"}}]
[null,null,null,null,null,null,null,null,null,null,null,null,null,null,null,null,null,null,null,{"$error":"#DIV/0!"},{"$f":"'Input Screen'!$C$8*5280*'Input Screen'!$C$9*2*(T493-$T$6)/12*0.0575","v":{"$error":"#DIV/0!"}},{"$f":"U493/'Input Screen'!$C$8","v":{"$error":"#DIV/0!"}},{"$error":"#DIV/0!"},{"$error":"#DIV/0!"},{"$f":"U493*'Input Screen'!$C$21/1000000","v":{"$error":"#DIV/0!"}},null,null,null,null,null,null,null,null,null,null,null,null,null,null,null,null,null,null,null,{"$f":"'Input Screen'!$C$8*5280*$AU$4*'Input Screen'!$C$9*2*(T493-$T$6)/12*0.0575","v":{"$error":"#DIV/0!"}},{"$error":"#DIV/0!"},{"$f":"AS493/($AU$4*'Input Screen'!$C$8)","v":{"$error":"#DIV/0!"}},{"$error":"#DIV/0!"},{"$error":"#DIV/0!"},{"$f":"AS493*'Input Screen'!$C$21/1000000","v":{"$error":"#DIV/0!"}}]
[null,null,null,null,null,null,null,null,null,null,null,null,null,null,null,null,null,null,null,{"$error":"#DIV/0!"},{"$f":"'Input Screen'!$C$8*5280*'Input Screen'!$C$9*2*(T494-$T$6)/12*0.0575","v":{"$error":"#DIV/0!"}},{"$f":"U494/'Input Screen'!$C$8","v":{"$error":"#DIV/0!"}},{"$error":"#DIV/0!"},{"$error":"#DIV/0!"},{"$f":"U494*'Input Screen'!$C$21/1000000","v":{"$error":"#DIV/0!"}},null,null,null,null,null,null,null,null,null,null,null,null,null,null,null,null,null,null,null,{"$f":"'Input Screen'!$C$8*5280*$AU$4*'Input Screen'!$C$9*2*(T494-$T$6)/12*0.0575","v":{"$error":"#DIV/0!"}},{"$error":"#DIV/0!"},{"$f":"AS494/($AU$4*'Input Screen'!$C$8)","v":{"$error":"#DIV/0!"}},{"$error":"#DIV/0!"},{"$error":"#DIV/0!"},{"$f":"AS494*'Input Screen'!$C$21/1000000","v":{"$error":"#DIV/0!"}}]
[null,null,null,null,null,null,null,null,null,null,null,null,null,null,null,null,null,null,null,{"$error":"#DIV/0!"},{"$f":"'Input Screen'!$C$8*5280*'Input Screen'!$C$9*2*(T495-$T$6)/12*0.0575","v":{"$error":"#DIV/0!"}},{"$f":"U495/'Input Screen'!$C$8","v":{"$error":"#DIV/0!"}},{"$error":"#DIV/0!"},{"$error":"#DIV/0!"},{"$f":"U495*'Input Screen'!$C$21/1000000","v":{"$error":"#DIV/0!"}},null,null,null,null,null,null,null,null,null,null,null,null,null,null,null,null,null,null,null,{"$f":"'Input Screen'!$C$8*5280*$AU$4*'Input Screen'!$C$9*2*(T495-$T$6)/12*0.0575","v":{"$error":"#DIV/0!"}},{"$error":"#DIV/0!"},{"$f":"AS495/($AU$4*'Input Screen'!$C$8)","v":{"$error":"#DIV/0!"}},{"$error":"#DIV/0!"},{"$error":"#DIV/0!"},{"$f":"AS495*'Input Screen'!$C$21/1000000","v":{"$error":"#DIV/0!"}}]
[null,null,null,null,null,null,null,null,null,null,null,null,null,null,null,null,null,null,null,{"$error":"#DIV/0!"},{"$f":"'Input Screen'!$C$8*5280*'Input Screen'!$C$9*2*(T496-$T$6)/12*0.0575","v":{"$error":"#DIV/0!"}},{"$f":"U496/'Input Screen'!$C$8","v":{"$error":"#DIV/0!"}},{"$error":"#DIV/0!"},{"$error":"#DIV/0!"},{"$f":"U496*'Input Screen'!$C$21/1000000","v":{"$error":"#DIV/0!"}},null,null,null,null,null,null,null,null,null,null,null,null,null,null,null,null,null,null,null,{"$f":"'Input Screen'!$C$8*5280*$AU$4*'Input Screen'!$C$9*2*(T496-$T$6)/12*0.0575","v":{"$error":"#DIV/0!"}},{"$error":"#DIV/0!"},{"$f":"AS496/($AU$4*'Input Screen'!$C$8)","v":{"$error":"#DIV/0!"}},{"$error":"#DIV/0!"},{"$error":"#DIV/0!"},{"$f":"AS496*'Input Screen'!$C$21/1000000","v":{"$error":"#DIV/0!"}}]
[null,null,null,null,null,null,null,null,null,null,null,null,null,null,null,null,null,null,null,{"$error":"#DIV/0!"},{"$f":"'Input Screen'!$C$8*5280*'Input Screen'!$C$9*2*(T497-$T$6)/12*0.0575","v":{"$error":"#DIV/0!"}},{"$f":"U497/'Input Screen'!$C$8","v":{"$error":"#DIV/0!"}},{"$error":"#DIV/0!"},{"$error":"#DIV/0!"},{"$f":"U497*'Input Screen'!$C$21/1000000","v":{"$error":"#DIV/0!"}},null,null,null,null,null,null,null,null,null,null,null,null,null,null,null,null,null,null,null,{"$f":"'Input Screen'!$C$8*5280*$AU$4*'Input Screen'!$C$9*2*(T497-$T$6)/12*0.0575","v":{"$error":"#DIV/0!"}},{"$error":"#DIV/0!"},{"$f":"AS497/($AU$4*'Input Screen'!$C$8)","v":{"$error":"#DIV/0!"}},{"$error":"#DIV/0!"},{"$error":"#DIV/0!"},{"$f":"AS497*'Input Screen'!$C$21/1000000","v":{"$error":"#DIV/0!"}}]
[null,null,null,null,null,null,null,null,null,null,null,null,null,null,null,null,null,null,null,{"$error":"#DIV/0!"},{"$f":"'Input Screen'!$C$8*5280*'Input Screen'!$C$9*2*(T498-$T$6)/12*0.0575","v":{"$error":"#DIV/0!"}},{"$f":"U498/'Input Screen'!$C$8","v":{"$error":"#DIV/0!"}},{"$error":"#DIV/0!"},{"$error":"#DIV/0!"},{"$f":"U498*'Input Screen'!$C$21/1000000","v":{"$error":"#DIV/0!"}},null,null,null,null,null,null,null,null,null,null,null,null,null,null,null,null,null,null,null,{"$f":"'Input Screen'!$C$8*5280*$AU$4*'Input Screen'!$C$9*2*(T498-$T$6)/12*0.0575","v":{"$error":"#DIV/0!"}},{"$error":"#DIV/0!"},{"$f":"AS498/($AU$4*'Input Screen'!$C$8)","v":{"$error":"#DIV/0!"}},{"$error":"#DIV/0!"},{"$error":"#DIV/0!"},{"$f":"AS498*'Input Screen'!$C$21/1000000","v":{"$error":"#DIV/0!"}}]
[null,null,null,null,null,null,null,null,null,null,null,null,null,null,null,null,null,null,null,{"$error":"#DIV/0!"},{"$f":"'Input Screen'!$C$8*5280*'Input Screen'!$C$9*2*(T499-$T$6)/12*0.0575","v":{"$error":"#DIV/0!"}},{"$f":"U499/'Input Screen'!$C$8","v":{"$error":"#DIV/0!"}},{"$error":"#DIV/0!"},{"$error":"#DIV/0!"},{"$f":"U499*'Input Screen'!$C$21/1000000","v":{"$error":"#DIV/0!"}},null,null,null,null,null,null,null,null,null,null,null,null,null,null,null,null,null,null,null,{"$f":"'Input Screen'!$C$8*5280*$AU$4*'Input Screen'!$C$9*2*(T499-$T$6)/12*0.0575","v":{"$error":"#DIV/0!"}},{"$error":"#DIV/0!"},{"$f":"AS499/($AU$4*'Input Screen'!$C$8)","v":{"$error":"#DIV/0!"}},{"$error":"#DIV/0!"},{"$error":"#DIV/0!"},{"$f":"AS499*'Input Screen'!$C$21/1000000","v":{"$error":"#DIV/0!"}}]
[null,null,null,null,null,null,null,null,null,null,null,null,null,null,null,null,null,null,null,{"$error":"#DIV/0!"},{"$f":"'Input Screen'!$C$8*5280*'Input Screen'!$C$9*2*(T500-$T$6)/12*0.0575","v":{"$error":"#DIV/0!"}},{"$f":"U500/'Input Screen'!$C$8","v":{"$error":"#DIV/0!"}},{"$error":"#DIV/0!"},{"$error":"#DIV/0!"},{"$f":"U500*'Input Screen'!$C$21/1000000","v":{"$error":"#DIV/0!"}},null,null,null,null,null,null,null,null,null,null,null,null,null,null,null,null,null,null,null,{"$f":"'Input Screen'!$C$8*5280*$AU$4*'Input Screen'!$C$9*2*(T500-$T$6)/12*0.0575","v":{"$error":"#DIV/0!"}},{"$error":"#DIV/0!"},{"$f":"AS500/($AU$4*'Input Screen'!$C$8)","v":{"$error":"#DIV/0!"}},{"$error":"#DIV/0!"},{"$error":"#DIV/0!"},{"$f":"AS500*'Input Screen'!$C$21/1000000","v":{"$error":"#DIV/0!"}}]
[null,null,null,null,null,null,null,null,null,null,null,null,null,null,null,null,null,null,null,{"$error":"#DIV/0!"},{"$f":"'Input Screen'!$C$8*5280*'Input Screen'!$C$9*2*(T501-$T$6)/12*0.0575","v":{"$error":"#DIV/0!"}},{"$f":"U501/'Input Screen'!$C$8","v":{"$error":"#DIV/0!"}},{"$error":"#DIV/0!"},{"$error":"#DIV/0!"},{"$f":"U501*'Input Screen'!$C$21/1000000","v":{"$error":"#DIV/0!"}},null,null,null,null,null,null,null,null,null,null,null,null,null,null,null,null,null,null,null,{"$f":"'Input Screen'!$C$8*5280*$AU$4*'Input Screen'!$C$9*2*(T501-$T$6)/12*0.0575","v":{"$error":"#DIV/0!"}},{"$error":"#DIV/0!"},{"$f":"AS501/($AU$4*'Input Screen'!$C$8)","v":{"$error":"#DIV/0!"}},{"$error":"#DIV/0!"},{"$error":"#DIV/0!"},{"$f":"AS501*'Input Screen'!$C$21/1000000","v":{"$error":"#DIV/0!"}}]
[null,null,null,null,null,null,null,null,null,null,null,null,null,null,null,null,null,null,null,{"$error":"#DIV/0!"},{"$f":"'Input Screen'!$C$8*5280*'Input Screen'!$C$9*2*(T502-$T$6)/12*0.0575","v":{"$error":"#DIV/0!"}},{"$f":"U502/'Input Screen'!$C$8","v":{"$error":"#DIV/0!"}},{"$error":"#DIV/0!"},{"$error":"#DIV/0!"},{"$f":"U502*'Input Screen'!$C$21/1000000","v":{"$error":"#DIV/0!"}},null,null,null,null,null,null,null,null,null,null,null,null,null,null,null,null,null,null,null,{"$f":"'Input Screen'!$C$8*5280*$AU$4*'Input Screen'!$C$9*2*(T502-$T$6)/12*0.0575","v":{"$error":"#DIV/0!"}},{"$error":"#DIV/0!"},{"$f":"AS502/($AU$4*'Input Screen'!$C$8)","v":{"$error":"#DIV/0!"}},{"$error":"#DIV/0!"},{"$error":"#DIV/0!"},{"$f":"AS502*'Input Screen'!$C$21/1000000","v":{"$error":"#DIV/0!"}}]
[null,null,null,null,null,null,null,null,null,null,null,null,null,null,null,null,null,null,null,{"$error":"#DIV/0!"},{"$f":"'Input Screen'!$C$8*5280*'Input Screen'!$C$9*2*(T503-$T$6)/12*0.0575","v":{"$error":"#DIV/0!"}},{"$f":"U503/'Input Screen'!$C$8","v":{"$error":"#DIV/0!"}},{"$error":"#DIV/0!"},{"$error":"#DIV/0!"},{"$f":"U503*'Input Screen'!$C$21/1000000","v":{"$error":"#DIV/0!"}},null,null,null,null,null,null,null,null,null,null,null,null,null,null,null,null,null,null,null,{"$f":"'Input Screen'!$C$8*5280*$AU$4*'Input Screen'!$C$9*2*(T503-$T$6)/12*0.0575","v":{"$error":"#DIV/0!"}},{"$error":"#DIV/0!"},{"$f":"AS503/($AU$4*'Input Screen'!$C$8)","v":{"$error":"#DIV/0!"}},{"$error":"#DIV/0!"},{"$error":"#DIV/0!"},{"$f":"AS503*'Input Screen'!$C$21/1000000","v":{"$error":"#DIV/0!"}}]
[null,null,null,null,null,null,null,null,null,null,null,null,null,null,null,null,null,null,null,{"$error":"#DIV/0!"},{"$f":"'Input Screen'!$C$8*5280*'Input Screen'!$C$9*2*(T504-$T$6)/12*0.0575","v":{"$error":"#DIV/0!"}},{"$f":"U504/'Input Screen'!$C$8","v":{"$error":"#DIV/0!"}},{"$error":"#DIV/0!"},{"$error":"#DIV/0!"},{"$f":"U504*'Input Screen'!$C$21/1000000","v":{"$error":"#DIV/0!"}},null,null,null,null,null,null,null,null,null,null,null,null,null,null,null,null,null,null,null,{"$f":"'Input Screen'!$C$8*5280*$AU$4*'Input Screen'!$C$9*2*(T504-$T$6)/12*0.0575","v":{"$error":"#DIV/0!"}},{"$error":"#DIV/0!"},{"$f":"AS504/($AU$4*'Input Screen'!$C$8)","v":{"$error":"#DIV/0!"}},{"$error":"#DIV/0!"},{"$error":"#DIV/0!"},{"$f":"AS504*'Input Screen'!$C$21/1000000","v":{"$error":"#DIV/0!"}}]
[null,null,null,null,null,null,null,null,null,null,null,null,null,null,null,null,null,null,null,{"$error":"#DIV/0!"},{"$f":"'Input Screen'!$C$8*5280*'Input Screen'!$C$9*2*(T505-$T$6)/12*0.0575","v":{"$error":"#DIV/0!"}},{"$f":"U505/'Input Screen'!$C$8","v":{"$error":"#DIV/0!"}},{"$error":"#DIV/0!"},{"$error":"#DIV/0!"},{"$f":"U505*'Input Screen'!$C$21/1000000","v":{"$error":"#DIV/0!"}},null,null,null,null,null,null,null,null,null,null,null,null,null,null,null,null,null,null,null,{"$f":"'Input Screen'!$C$8*5280*$AU$4*'Input Screen'!$C$9*2*(T505-$T$6)/12*0.0575","v":{"$error":"#DIV/0!"}},{"$error":"#DIV/0!"},{"$f":"AS505/($AU$4*'Input Screen'!$C$8)","v":{"$error":"#DIV/0!"}},{"$error":"#DIV/0!"},{"$error":"#DIV/0!"},{"$f":"AS505*'Input Screen'!$C$21/1000000","v":{"$error":"#DIV/0!"}}]
[null,null,null,null,null,null,null,null,null,null,null,null,null,null,null,null,null,null,null,{"$error":"#DIV/0!"},{"$f":"'Input Screen'!$C$8*5280*'Input Screen'!$C$9*2*(T506-$T$6)/12*0.0575","v":{"$error":"#DIV/0!"}},{"$f":"U506/'Input Screen'!$C$8","v":{"$error":"#DIV/0!"}},{"$error":"#DIV/0!"},{"$error":"#DIV/0!"},{"$f":"U506*'Input Screen'!$C$21/1000000","v":{"$error":"#DIV/0!"}},null,null,null,null,null,null,null,null,null,null,null,null,null,null,null,null,null,null,null,{"$f":"'Input Screen'!$C$8*5280*$AU$4*'Input Screen'!$C$9*2*(T506-$T$6)/12*0.0575","v":{"$error":"#DIV/0!"}},{"$error":"#DIV/0!"},{"$f":"AS506/($AU$4*'Input Screen'!$C$8)","v":{"$error":"#DIV/0!"}},{"$error":"#DIV/0!"},{"$error":"#DIV/0!"},{"$f":"AS506*'Input Screen'!$C$21/1000000","v":{"$error":"#DIV/0!"}}]