{"text_format":"1","workbook":"xlsx","n_sheets":5,"sheets":["Introduction","Input Screen","Rock Requirement Estimates","Final Report","Background"],"not_rendered":{"charts":5,"images":2,"macros":1,"external_links":0,"defined_names":6,"comments":0,"pivot_tables":0},"unopened":[],"bounds":{"document_bytes":16777216,"sheet_cells":100000,"rows_first":2000,"rows_last":500,"rows_between":2000,"halvings":0,"cell_chars":16384,"cell_head_chars":4096},"cells_cut":0,"cells_raw":0,"read":"whole","date_system":"1900"}

{"sheet":"Introduction","index":0,"n_rows":10,"n_cols":2,"rows_kept":10,"cut":false,"hidden":false,"merged":[]}
[]
[]
[]
[]
[]
[null,"Welcome to Iowa County Engineers Association (ICEA) Granular Roads Asset Management System (GRAMS)"]
[]
[null,"This tool is developed to help Iowa local agencies to approximate annual rock requirement to effectively maintain the granular roadway network. Local agencies can choose roadway treatment policy based on unique budget scenario and required level of service to determine amount of rock needed in terms of ton per mile (TPM)."]
[]
[null,"GRAMS tool consists of two major section. User needs to provide agency specific local information in the input screen regarding the granular roadway inventory condition and cost information. Based on input data, the tool will generate annual rock requirement report. "]
{"$rows_left_out":1}
{"sheet":"Input Screen","index":1,"n_rows":31,"n_cols":4,"rows_kept":31,"cut":false,"hidden":false,"merged":[[16,3,17,3],[33,3,34,3],[5,3,9,3],[20,3,25,3]]}
[]
[]
[]
[]
[]
[null,"County Name",null,"Note: Enter county and granular roadway network informatiom"]
[]
[null,"Granular Roadway Network Size (miles)"]
[null,"Average Roadway Width (feet)"]
[null,"Percentage of Roadway with Poor Drainage (Ditch) Cross Section"]
{"$rows_left_out":22}
{"sheet":"Rock Requirement Estimates","index":2,"n_rows":25,"n_cols":7,"rows_kept":25,"cut":false,"hidden":false,"merged":[[8,4,11,4]]}
[]
[]
[]
[]
[]
[null,null,"Inventory Condition"]
[]
[null,"Roadway Condition","Thickness (inches)","Percentage of Granular Road Network"]
[null,"Excellent","over 5",null,"Note: Enter granular roadway network inventory information"]
[null,"Good","4 to 5"]
{"$rows_left_out":16}
{"sheet":"Final Report","index":3,"n_rows":51,"n_cols":7,"rows_kept":51,"cut":false,"hidden":false,"merged":[[17,5,17,8],[50,4,50,9]]}
[]
[]
[]
[]
[]
[null,"County",{"$f":"'Input Screen'!C6","v":0}]
[null,"Most Critical System Size (miles)",{"$f":"'Rock Requirement Estimates'!C19","v":0}]
[null,null,null,"Range of Options"]
[null,null,null,"Rock Application Case (miles)",{"$f":"'Input Screen'!C8","v":0}]
[null,"Tons per Mile (TPM)","Rock Quantity (Ton)","Total Cost ($)","Material Cost ($)","Reliability (%)","System Performance"]
{"$rows_left_out":42}
{"sheet":"Background","index":4,"n_rows":506,"n_cols":125,"rows_kept":506,"cut":false,"hidden":false,"merged":[]}
[]
[]
[]
[null,"Roadway Surface Declination over time",null,null,"Thickness (inches)",null,null,null,null,null,null,null,null,null,null,null,null,null,null,null,null,null,"Type 1",null,null,null,"Survival Analysis Curve",null,null,null,null,null,null,null,null,null,null,null,"Level of Service","Type 1",null,null,null,null,null,"Rock Application Range",{"$f":"'Final Report'!$C$48","v":0.5},null,null,null,null,null,null,null,null,null,null,null,null,null,null,null,null,null,null,null,null,null,null,null,null,null,null,null,null,null,null,null,null,null,null,null,null,null,null,null,null,null,null,null,null,null,null,null,null,null,null,null,null,null,null,null,null,null,null,null,null,null,null,null,null,null,null,null,null,null,null,"Type 1"]
[null,"Current Condition","Existing","After 6 Months","After 12 Months","After 18 Months","After 24 months","After 36 Months","After 48 Months",null,null,"Weibull Distribution Parameters",null,null,"Resurfacing Needed after 1 Year (miles)","Rock in Service after 1 year (TPM)",null," Cost ($/Ton)",null,"system thickness (inchess)","Rock Requirement (Ton)","Tons per Mile (TPM)","System at Risk (%)","Cost ($)","Material Cost ($)","Time (months)","Failure Probability","Survival Probability",null,null,null,null,"LA Abrasion (%)","Percentage of Fines (%)",null,null,"TPM","Rock Quantity (Ton)","Thickness (inches)","Level of Service (%)","System Performance",null,null,null,"Rock Requirement (ton)","thickness (inches)","TPM","System at Risk (%)","Cost ($)","Material Cost ($)",null,null,"Minimum Acceptable Roadway thickness (inches)",null,null,null,null,null,null,null,null,null,null,null,null,null,null,null,null,null,null,null,null,null,null,null,null,null,null,null,null,null,null,null,null,null,null,null,null,null,null,null,null,null,null,null,null,null,null,null,null,null,null,null,"County","Precipitation Rate (in/hr)","Traffic (AADT)","Soil Quality","Zone","County","AADT","Zone",null,null,null,null,null,"LA Abrasion","% of fines","Gravel loss (in)",null,null,null,null,"Final Gravel loss"]
[null,"Excellent",5,{"$f":"IF(D18>=0,D18,0)","v":{"$error":"#VALUE!"}},{"$f":"IF(E18>=0,E18,0)","v":{"$error":"#VALUE!"}},{"$error":"#VALUE!"},{"$error":"#VALUE!"},{"$error":"#VALUE!"},{"$error":"#VALUE!"},null,null,"shape",{"$f":"IF((1/0.26+3.96*D25-0.11*I25)<=0,1.3,(1/0.26+3.96*D25-0.11*I25))","v":{"$error":"#VALUE!"}},null,{"$f":"(_xlfn.WEIBULL.DIST(12,$M$6,$M$7,TRUE)*'Input Screen'!$C$8)","v":{"$error":"#VALUE!"}},{"$f":"'Input Screen'!C8*'Input Screen'!C9*5280*Background!E12/12*0.0575/'Input Screen'!C8","v":{"$error":"#VALUE!"}},null,{"$f":"'Input Screen'!C21+'Input Screen'!C22+'Input Screen'!C23+'Input Screen'!C25*'Input Screen'!C24+'Input Screen'!C26","v":0},null,{"$f":"$E$13","v":{"$error":"#DIV/0!"}},{"$f":"'Input Screen'!$C$8*5280*'Input Screen'!$C$9*2*(T6-$T$6)/12*0.0575","v":{"$error":"#DIV/0!"}},{"$f":"U6/'Input Screen'!$C$8","v":{"$error":"#DIV/0!"}},{"$f":"1-(_xlfn.NORM.S.DIST((T6-$BA$6)/((MAX($T$6:$T$306)-$BA$6)/6),TRUE))","v":{"$error":"#DIV/0!"}},{"$f":"U6*$R$6/1000000","v":{"$error":"#DIV/0!"}},{"$f":"U6*'Input Screen'!$C$21/1000000","v":{"$error":"#DIV/0!"}},{"$f":"0.1","v":0.1},{"$f":"(_xlfn.WEIBULL.DIST(Z6,$M$6,$M$7,TRUE))","v":{"$error":"#VALUE!"}},{"$f":"1-AA6","v":{"$error":"#VALUE!"}},null,null,null,1,0.38500000000000001,6.6500000000000004E-2,null,null,100,{"$f":"2*'Input Screen'!$C$8*5280*'Input Screen'!$C$9*(Background!AM6-Background!$E$13)/12*0.0575","v":{"$error":"#DIV/0!"}},{"$f":"AK6*12/(5280*'Input Screen'!$C$9*2*0.0575)+$E$13","v":{"$error":"#DIV/0!"}},{"$f":"_xlfn.NORM.S.DIST((AM6-$BA$6)/((MAX($T$6:$T$306)-$BA$6)/6),TRUE)","v":{"$error":"#DIV/0!"}},{"$f":"IF(AN6<0.5,\"Poor\",IF(AN6<0.6,\"Marginal\",IF(AN6<0.7,\"Fair\",IF(AN6<0.8,\"Good\",IF(AN6<0.9,\"Very Good\",\"Excellent\")))))","v":{"$error":"#DIV/0!"}},null,null,null,{"$f":"'Input Screen'!$C$8*5280*$AU$4*'Input Screen'!$C$9*2*(T6-$T$6)/12*0.0575","v":{"$error":"#DIV/0!"}},{"$f":"$E$13","v":{"$error":"#DIV/0!"}},{"$f":"AS6/($AU$4*'Input Screen'!$C$8)","v":{"$error":"#DIV/0!"}},{"$f":"1-(_xlfn.NORM.S.DIST((AT6-$BA$6)/((MAX($T$6:$T$306)-$BA$6)/6),TRUE))","v":{"$error":"#DIV/0!"}},{"$f":"AS6*$R$6/1000000","v":{"$error":"#DIV/0!"}},{"$f":"AS6*'Input Screen'!$C$21/1000000","v":{"$error":"#DIV/0!"}},null,null,{"$f":"IF('Input Screen'!C31=0,'Input Screen'!C29,'Input Screen'!C31)","v":"Error, Check county name spelling"},null,null,null,null,null,null,null,null,null,null,null,null,null,null,null,null,null,null,null,null,null,null,null,null,null,null,null,null,null,null,null,null,null,null,null,null,null,null,null,null,null,null,null,null,null,null,null,null,null,null,null,"Adair",5.0309823365671039E-3,47,1.18,2,{"$f":"'Input Screen'!C6","v":0},{"$f":"IFERROR(VLOOKUP(DF6,DA5:DD105,3,FALSE),0)","v":0},{"$f":"IFERROR(VLOOKUP(DF6,DA5:DE105,5,FALSE),0)","v":0},null,null,null,null,null,{"$f":"IF('Input Screen'!C17=0,'Input Screen'!C14,'Input Screen'!C17)","v":"Error, Check county name spelling"},{"$f":"IF('Input Screen'!C18=0,'Input Screen'!C15,'Input Screen'!C18)","v":"Error, Check county name spelling"},{"$f":"IFERROR(AVERAGE(1/(1+EXP(-(-6.33+0.18*(DN6*100)))),1/(1+EXP(-(-27.2+2.41*(DO6*100)+0.15*(DG6))))),\"Error, check county name spelling\")","v":"Error, check county name spelling"},null,null,null,null,{"$f":"IF('Rock Requirement Estimates'!C17=0,'Rock Requirement Estimates'!C15,'Rock Requirement Estimates'!C17)","v":"Error, check county name spelling"}]
[null,"Good",4.5,{"$f":"IF(D19>=0,D19,0)","v":{"$error":"#VALUE!"}},{"$error":"#VALUE!"},{"$error":"#VALUE!"},{"$error":"#VALUE!"},{"$error":"#VALUE!"},{"$error":"#VALUE!"},null,null,"scale",{"$f":"72.3-33.22*F25-27.48*I25","v":{"$error":"#VALUE!"}},null,null,null,null,null,null,{"$f":"IF(T6>=5,5,T6+0.01)","v":{"$error":"#DIV/0!"}},{"$f":"'Input Screen'!$C$8*5280*'Input Screen'!$C$9*2*(T7-$T$6)/12*0.0575","v":{"$error":"#DIV/0!"}},{"$f":"U7/'Input Screen'!$C$8","v":{"$error":"#DIV/0!"}},{"$f":"1-(_xlfn.NORM.S.DIST((T7-$BA$6)/((MAX($T$6:$T$306)-$BA$6)/6),TRUE))","v":{"$error":"#DIV/0!"}},{"$f":"U7*$R$6/1000000","v":{"$error":"#DIV/0!"}},{"$f":"U7*'Input Screen'!$C$21/1000000","v":{"$error":"#DIV/0!"}},{"$f":"Z6+0.1","v":0.2},{"$f":"(_xlfn.WEIBULL.DIST(Z7,$M$6,$M$7,TRUE))","v":{"$error":"#VALUE!"}},{"$f":"1-AA7","v":{"$error":"#VALUE!"}},null,null,null,2,0.4022,8.2500000000000004E-2,null,null,200,{"$f":"2*'Input Screen'!$C$8*5280*'Input Screen'!$C$9*(Background!AM7-Background!$E$13)/12*0.0575","v":{"$error":"#DIV/0!"}},{"$f":"AK7*12/(5280*'Input Screen'!$C$9*2*0.0575)+$E$13","v":{"$error":"#DIV/0!"}},{"$f":"_xlfn.NORM.S.DIST((AM7-$BA$6)/((MAX($T$6:$T$306)-$BA$6)/6),TRUE)","v":{"$error":"#DIV/0!"}},{"$f":"IF(AN7<0.5,\"Poor\",IF(AN7<0.6,\"Marginal\",IF(AN7<0.7,\"Fair\",IF(AN7<0.8,\"Good\",IF(AN7<0.9,\"Very Good\",\"Excellent\")))))","v":{"$error":"#DIV/0!"}},null,null,null,{"$f":"'Input Screen'!$C$8*5280*$AU$4*'Input Screen'!$C$9*2*(T7-$T$6)/12*0.0575","v":{"$error":"#DIV/0!"}},{"$f":"IF(AT6>=5,5,AT6+0.01)","v":{"$error":"#DIV/0!"}},{"$f":"AS7/($AU$4*'Input Screen'!$C$8)","v":{"$error":"#DIV/0!"}},{"$f":"1-(_xlfn.NORM.S.DIST((AT7-$BA$6)/((MAX($T$6:$T$306)-$BA$6)/6),TRUE))","v":{"$error":"#DIV/0!"}},{"$f":"AS7*$R$6/1000000","v":{"$error":"#DIV/0!"}},{"$f":"AS7*'Input Screen'!$C$21/1000000","v":{"$error":"#DIV/0!"}},null,null,null,null,null,null,null,null,null,null,null,null,null,null,null,null,null,null,null,null,null,null,null,null,null,null,null,null,null,null,null,null,null,null,null,null,null,null,null,null,null,null,null,null,null,null,null,null,null,null,null,null,null,null,"Adams",5.1431685192561303E-3,32,1.22,2]
[null,"Fair",3.5,{"$error":"#VALUE!"},{"$error":"#VALUE!"},{"$error":"#VALUE!"},{"$error":"#VALUE!"},{"$error":"#VALUE!"},{"$error":"#VALUE!"},null,null,null,null,null,null,null,null,null,null,{"$f":"IF(T7>=5,5,T7+0.01)","v":{"$error":"#DIV/0!"}},{"$f":"'Input Screen'!$C$8*5280*'Input Screen'!$C$9*2*(T8-$T$6)/12*0.0575","v":{"$error":"#DIV/0!"}},{"$f":"U8/'Input Screen'!$C$8","v":{"$error":"#DIV/0!"}},{"$error":"#DIV/0!"},{"$error":"#DIV/0!"},{"$f":"U8*'Input Screen'!$C$21/1000000","v":{"$error":"#DIV/0!"}},{"$f":"Z7+0.1","v":0.30000000000000004},{"$error":"#VALUE!"},{"$error":"#VALUE!"},null,null,null,3,0.31569999999999998,7.8799999999999995E-2,null,null,300,{"$f":"2*'Input Screen'!$C$8*5280*'Input Screen'!$C$9*(Background!AM8-Background!$E$13)/12*0.0575","v":{"$error":"#DIV/0!"}},{"$f":"AK8*12/(5280*'Input Screen'!$C$9*2*0.0575)+$E$13","v":{"$error":"#DIV/0!"}},{"$error":"#DIV/0!"},{"$error":"#DIV/0!"},null,null,null,{"$f":"'Input Screen'!$C$8*5280*$AU$4*'Input Screen'!$C$9*2*(T8-$T$6)/12*0.0575","v":{"$error":"#DIV/0!"}},{"$f":"IF(AT7>=5,5,AT7+0.01)","v":{"$error":"#DIV/0!"}},{"$f":"AS8/($AU$4*'Input Screen'!$C$8)","v":{"$error":"#DIV/0!"}},{"$error":"#DIV/0!"},{"$error":"#DIV/0!"},{"$f":"AS8*'Input Screen'!$C$21/1000000","v":{"$error":"#DIV/0!"}},null,null,null,null,null,null,null,null,null,null,null,null,null,null,null,null,null,null,null,null,null,null,null,null,null,null,null,null,null,null,null,null,null,null,null,null,null,null,null,null,null,null,null,null,null,null,null,null,null,null,null,null,null,null,"Allamakee",5.1699999999999992E-3,55,1.58,2]
[null,"Poor",2.5,{"$error":"#VALUE!"},{"$error":"#VALUE!"},{"$error":"#VALUE!"},{"$error":"#VALUE!"},{"$error":"#VALUE!"},{"$error":"#VALUE!"},null,null,null,null,null,null,null,null,null,null,{"$error":"#DIV/0!"},{"$f":"'Input Screen'!$C$8*5280*'Input Screen'!$C$9*2*(T9-$T$6)/12*0.0575","v":{"$error":"#DIV/0!"}},{"$f":"U9/'Input Screen'!$C$8","v":{"$error":"#DIV/0!"}},{"$error":"#DIV/0!"},{"$error":"#DIV/0!"},{"$f":"U9*'Input Screen'!$C$21/1000000","v":{"$error":"#DIV/0!"}},0.4,{"$error":"#VALUE!"},{"$error":"#VALUE!"},null,null,null,4,0.33329999999999999,8.6699999999999999E-2,null,null,400,{"$f":"2*'Input Screen'!$C$8*5280*'Input Screen'!$C$9*(Background!AM9-Background!$E$13)/12*0.0575","v":{"$error":"#DIV/0!"}},{"$f":"AK9*12/(5280*'Input Screen'!$C$9*2*0.0575)+$E$13","v":{"$error":"#DIV/0!"}},{"$error":"#DIV/0!"},{"$error":"#DIV/0!"},null,null,null,{"$f":"'Input Screen'!$C$8*5280*$AU$4*'Input Screen'!$C$9*2*(T9-$T$6)/12*0.0575","v":{"$error":"#DIV/0!"}},{"$error":"#DIV/0!"},{"$f":"AS9/($AU$4*'Input Screen'!$C$8)","v":{"$error":"#DIV/0!"}},{"$error":"#DIV/0!"},{"$error":"#DIV/0!"},{"$f":"AS9*'Input Screen'!$C$21/1000000","v":{"$error":"#DIV/0!"}},null,null,null,null,null,null,null,null,null,null,null,null,null,null,null,null,null,null,null,null,null,null,null,null,null,null,null,null,null,null,null,null,null,null,null,null,null,null,null,null,null,null,null,null,null,null,null,null,null,null,null,null,null,null,"Appanoose",5.3516775341119786E-3,52,1.3,1]
[null,"Unacceptable",1.5,{"$error":"#VALUE!"},{"$error":"#VALUE!"},{"$error":"#VALUE!"},{"$error":"#VALUE!"},{"$error":"#VALUE!"},{"$error":"#VALUE!"},null,null,null,null,null,null,null,null,null,null,{"$error":"#DIV/0!"},{"$f":"'Input Screen'!$C$8*5280*'Input Screen'!$C$9*2*(T10-$T$6)/12*0.0575","v":{"$error":"#DIV/0!"}},{"$f":"U10/'Input Screen'!$C$8","v":{"$error":"#DIV/0!"}},{"$error":"#DIV/0!"},{"$error":"#DIV/0!"},{"$f":"U10*'Input Screen'!$C$21/1000000","v":{"$error":"#DIV/0!"}},0.5,{"$error":"#VALUE!"},{"$error":"#VALUE!"},null,null,null,null,"error",null,null,null,500,{"$f":"2*'Input Screen'!$C$8*5280*'Input Screen'!$C$9*(Background!AM10-Background!$E$13)/12*0.0575","v":{"$error":"#DIV/0!"}},{"$f":"AK10*12/(5280*'Input Screen'!$C$9*2*0.0575)+$E$13","v":{"$error":"#DIV/0!"}},{"$error":"#DIV/0!"},{"$error":"#DIV/0!"},null,null,null,{"$f":"'Input Screen'!$C$8*5280*$AU$4*'Input Screen'!$C$9*2*(T10-$T$6)/12*0.0575","v":{"$error":"#DIV/0!"}},{"$error":"#DIV/0!"},{"$f":"AS10/($AU$4*'Input Screen'!$C$8)","v":{"$error":"#DIV/0!"}},{"$error":"#DIV/0!"},{"$error":"#DIV/0!"},{"$f":"AS10*'Input Screen'!$C$21/1000000","v":{"$error":"#DIV/0!"}},null,null,null,null,null,null,null,null,null,null,null,null,null,null,null,null,null,null,null,null,null,null,null,null,null,null,null,null,null,null,null,null,null,null,null,null,null,null,null,null,null,null,null,null,null,null,null,null,null,null,null,null,null,null,"Audubon",4.8684606630779318E-3,37,1.1499999999999999,2]
{"$rows_left_out":496}